Gentoo Websites Logo
Go to: Gentoo Home Documentation Forums Lists Bugs Planet Store Wiki Get Gentoo!
Bug 711690 - sys-apps/dstat-0.7.4-r1 : [TEST] make: *** [Makefile:<snip>: test] Error 1
Summary: sys-apps/dstat-0.7.4-r1 : [TEST] make: *** [Makefile:<snip>: test] Error 1
Status: RESOLVED FIXED
Alias: None
Product: Gentoo Linux
Classification: Unclassified
Component: Current packages (show other bugs)
Hardware: All Linux
: Normal normal (vote)
Assignee: Paul Healy
URL:
Whiteboard:
Keywords: PullRequest
Depends on:
Blocks:
 
Reported: 2020-03-06 15:25 UTC by Toralf Förster
Modified: 2020-10-20 19:39 UTC (History)
1 user (show)

See Also:
Package list:
Runtime testing required: ---


Attachments
emerge-info.txt (emerge-info.txt,17.39 KB, text/plain)
2020-03-06 15:25 UTC, Toralf Förster
Details
emerge-history.txt (emerge-history.txt,198.05 KB, text/plain)
2020-03-06 15:25 UTC, Toralf Förster
Details
environment (environment,94.06 KB, text/plain)
2020-03-06 15:25 UTC, Toralf Förster
Details
etc.portage.tbz2 (etc.portage.tbz2,20.81 KB, application/x-bzip)
2020-03-06 15:25 UTC, Toralf Förster
Details
sys-apps:dstat-0.7.4-r1:20200305-234432.log (sys-apps:dstat-0.7.4-r1:20200305-234432.log,2.61 KB, text/plain)
2020-03-06 15:25 UTC, Toralf Förster
Details
temp.tbz2 (temp.tbz2,20.96 KB, application/x-bzip)
2020-03-06 15:26 UTC, Toralf Förster
Details

Note You need to log in before you can comment on or make changes to this bug.
Description Toralf Förster gentoo-dev 2020-03-06 15:25:44 UTC
    import six
ModuleNotFoundError: No module named 'six'
make: *** [Makefile:38: test] Error 1
 * ERROR: sys-apps/dstat-0.7.4-r1::gentoo failed (test phase):
 *   Make test failed. See above for details.
 * 

  -------------------------------------------------------------------

  This is an unstable amd64 chroot image at a tinderbox (==build bot)
  name: 17.1_desktop_plasma-test-20200228-231731

  -------------------------------------------------------------------

gcc-config -l:
 [1] x86_64-pc-linux-gnu-9.2.0 *

clang:
clang version 9.0.1 
Target: x86_64-pc-linux-gnu
Thread model: posix
InstalledDir: /usr/lib/llvm/9/bin
llvm:
9.0.1
Available Python interpreters, in order of preference:
  [1]   python3.8
  [2]   python3.6
  [3]   python3.7 (fallback)
  [4]   python2.7 (fallback)

Available Rust versions:
  [1]   rust-1.41.1 *
java-config:
The following VMs are available for generation-2:
*)	IcedTea JDK 3.14.0 [icedtea-bin-8]
Available Java Virtual Machines:
  [1]   icedtea-bin-8  system-vm
ghc:
The Glorious Glasgow Haskell Compilation System, version 8.0.2

repository:
==> /var/db/repos/gentoo/metadata/timestamp.chk <==
Thu, 05 Mar 2020 21:07:27 +0000

emerge -qpvO sys-apps/dstat
[ebuild  N    ] sys-apps/dstat-0.7.4-r1  USE="-doc -examples -wifi" PYTHON_TARGETS="python2_7 python3_6 -python3_7"
Comment 1 Toralf Förster gentoo-dev 2020-03-06 15:25:47 UTC
Created attachment 617290 [details]
emerge-info.txt
Comment 2 Toralf Förster gentoo-dev 2020-03-06 15:25:50 UTC
Created attachment 617292 [details]
emerge-history.txt
Comment 3 Toralf Förster gentoo-dev 2020-03-06 15:25:53 UTC
Created attachment 617294 [details]
environment
Comment 4 Toralf Förster gentoo-dev 2020-03-06 15:25:56 UTC
Created attachment 617296 [details]
etc.portage.tbz2
Comment 5 Toralf Förster gentoo-dev 2020-03-06 15:25:59 UTC
Created attachment 617298 [details]
sys-apps:dstat-0.7.4-r1:20200305-234432.log
Comment 6 Toralf Förster gentoo-dev 2020-03-06 15:26:02 UTC
Created attachment 617300 [details]
temp.tbz2
Comment 7 Paul Healy 2020-05-04 17:43:12 UTC
Added fix at: https://github.com/gentoo/gentoo/pull/15644

Thanks!
Comment 8 Paul Healy 2020-06-21 13:12:54 UTC
Update PR at https://github.com/gentoo/gentoo/pull/15644 following juippis comments.
Comment 9 Paul Healy 2020-09-02 20:25:51 UTC
Updated PR at https://github.com/gentoo/gentoo/pull/15644 following comments.
Comment 10 Larry the Git Cow gentoo-dev 2020-09-02 20:30:48 UTC
The bug has been referenced in the following commit(s):

https://gitweb.gentoo.org/repo/gentoo.git/commit/?id=d82f3036667f032ace586bf51d32ab45ee0d8c54

commit d82f3036667f032ace586bf51d32ab45ee0d8c54
Author:     Paul Healy <lmiphay@gmail.com>
AuthorDate: 2020-09-02 20:03:44 +0000
Commit:     Sam James <sam@gentoo.org>
CommitDate: 2020-09-02 20:03:44 +0000

    sys-apps/dstat: fix test failure
    
    call the tests correctly with the correct python version(s)
    
    Bug: https://bugs.gentoo.org/711690
    Signed-off-by: Paul Healy <lmiphay@gmail.com>
    Closes: https://github.com/gentoo/gentoo/pull/15644
    Signed-off-by: Sam James <sam@gentoo.org>

 sys-apps/dstat/dstat-0.7.4-r2.ebuild | 4 ++++
 1 file changed, 4 insertions(+)
Comment 11 Paul Healy 2020-10-20 19:39:02 UTC
Fixed via https://github.com/gentoo/gentoo/pull/15644 which was merged 2020-09-02