Gentoo Websites Logo
Go to: Gentoo Home Documentation Forums Lists Bugs Planet Store Wiki Get Gentoo!
Bug 688764 - dev-util/cppcheck-1.87 : [TEST] TestGarbage:......................................................................................................................make: *** [Makefile:<snip>: check]<snip> Segmentation fault
Summary: dev-util/cppcheck-1.87 : [TEST] TestGarbage:....................................
Status: RESOLVED FIXED
Alias: None
Product: Gentoo Linux
Classification: Unclassified
Component: Current packages (show other bugs)
Hardware: All Linux
: Normal normal
Assignee: Matthias Maier
URL:
Whiteboard:
Keywords: TESTFAILURE
Depends on:
Blocks:
 
Reported: 2019-06-26 16:38 UTC by Toralf Förster
Modified: 2019-06-30 18:20 UTC (History)
0 users

See Also:
Package list:
Runtime testing required: ---


Attachments
emerge-info.txt (emerge-info.txt,14.98 KB, text/plain)
2019-06-26 16:38 UTC, Toralf Förster
Details
dev-util:cppcheck-1.87:20190626-152306.log (dev-util:cppcheck-1.87:20190626-152306.log,36.93 KB, text/plain)
2019-06-26 16:38 UTC, Toralf Förster
Details
emerge-history.txt (emerge-history.txt,114.16 KB, text/plain)
2019-06-26 16:38 UTC, Toralf Förster
Details
environment (environment,118.10 KB, text/plain)
2019-06-26 16:38 UTC, Toralf Förster
Details
etc.portage.tbz2 (etc.portage.tbz2,15.37 KB, application/x-bzip)
2019-06-26 16:38 UTC, Toralf Förster
Details
temp.tbz2 (temp.tbz2,27.94 KB, application/x-bzip)
2019-06-26 16:38 UTC, Toralf Förster
Details

Note You need to log in before you can comment on or make changes to this bug.
Description Toralf Förster gentoo-dev 2019-06-26 16:38:39 UTC
TestFileLister:..
TestFunctions:...........................
TestGarbage:......................................................................................................................make: *** [Makefile:265: check] Segmentation fault
 * ERROR: dev-util/cppcheck-1.87::gentoo failed (test phase):
 *   emake failed
 * 

  -------------------------------------------------------------------

  This is an unstable amd64 chroot image at a tinderbox (==build bot)
  name: 17.1-systemd_libressl-test_20190623-103445

  -------------------------------------------------------------------

gcc-config -l:
 [1] x86_64-pc-linux-gnu-8.3.1
 [2] x86_64-pc-linux-gnu-9.1.0 *

Available Python interpreters, in order of preference:
  [1]   python3.6
  [2]   python2.7 (fallback)

Available Rust versions:
  [1]   rust-1.35.0 *



emerge -qpvO dev-util/cppcheck
[ebuild  N    ] dev-util/cppcheck-1.87  USE="pcre -htmlreport -qt5" PYTHON_TARGETS="python2_7 python3_6 -python3_5 -python3_7"
Comment 1 Toralf Förster gentoo-dev 2019-06-26 16:38:42 UTC
Created attachment 581086 [details]
emerge-info.txt
Comment 2 Toralf Förster gentoo-dev 2019-06-26 16:38:45 UTC
Created attachment 581088 [details]
dev-util:cppcheck-1.87:20190626-152306.log
Comment 3 Toralf Förster gentoo-dev 2019-06-26 16:38:48 UTC
Created attachment 581090 [details]
emerge-history.txt
Comment 4 Toralf Förster gentoo-dev 2019-06-26 16:38:50 UTC
Created attachment 581092 [details]
environment
Comment 5 Toralf Förster gentoo-dev 2019-06-26 16:38:53 UTC
Created attachment 581094 [details]
etc.portage.tbz2
Comment 6 Toralf Förster gentoo-dev 2019-06-26 16:38:56 UTC
Created attachment 581096 [details]
temp.tbz2
Comment 7 Larry the Git Cow gentoo-dev 2019-06-30 18:20:08 UTC
The bug has been closed via the following commit(s):

https://gitweb.gentoo.org/repo/gentoo.git/commit/?id=1e2ade0e9fecfd14846864cf21067d9e03375cf2

commit 1e2ade0e9fecfd14846864cf21067d9e03375cf2
Author:     Matthias Maier <tamiko@gentoo.org>
AuthorDate: 2019-06-30 16:25:33 +0000
Commit:     Matthias Maier <tamiko@gentoo.org>
CommitDate: 2019-06-30 18:19:23 +0000

    dev-util/cppcheck: version bump to 1.88
    
     - Cannot reproduce test failure with new version
    
    Closes: https://bugs.gentoo.org/688764
    Package-Manager: Portage-2.3.67, Repoman-2.3.16
    Signed-off-by: Matthias Maier <tamiko@gentoo.org>

 dev-util/cppcheck/Manifest                         |   1 +
 dev-util/cppcheck/cppcheck-1.88.ebuild             | 113 +++++++++++++++++++++
 .../cppcheck/files/cppcheck-1.88-ldflags.patch     |  17 ++++
 .../cppcheck/files/cppcheck-1.88-tinyxml2.patch    | 101 ++++++++++++++++++
 4 files changed, 232 insertions(+)