Gentoo Websites Logo
Go to: Gentoo Home Documentation Forums Lists Bugs Planet Store Wiki Get Gentoo!
Bug 686392 - kde-plasma/discover-5.15.5 fails knsbackendtest
Summary: kde-plasma/discover-5.15.5 fails knsbackendtest
Status: RESOLVED FIXED
Alias: None
Product: Gentoo Linux
Classification: Unclassified
Component: Current packages (show other bugs)
Hardware: All Linux
: Normal normal
Assignee: Gentoo KDE team
URL:
Whiteboard:
Keywords: TESTFAILURE
Depends on:
Blocks:
 
Reported: 2019-05-20 13:19 UTC by Paolo Pedroni
Modified: 2019-06-05 19:06 UTC (History)
0 users

See Also:
Package list:
Runtime testing required: ---


Attachments
discover-5.15.5:20190520-123226.log.gz (discover-5.15.5:20190520-123226.log.gz,13.59 KB, application/gzip)
2019-05-20 13:19 UTC, Paolo Pedroni
Details

Note You need to log in before you can comment on or make changes to this bug.
Description Paolo Pedroni 2019-05-20 13:19:09 UTC
Created attachment 577392 [details]
discover-5.15.5:20190520-123226.log.gz

After solving bug #678916, one of the tests fails:

>>> Test phase: kde-plasma/discover-5.15.5
 * Scanning for an open DISPLAY to start Xvfb ...
 * Starting Xvfb on $DISPLAY=0 ...
>>> Working in BUILD_DIR: "/var/tmp/portage/kde-plasma/discover-5.15.5/work/discover-5.15.5_build"
ctest -j 15 --test-load 6
Test project /var/tmp/portage/kde-plasma/discover-5.15.5/work/discover-5.15.5_build
    Start 1: knsbackendtest
    Start 2: CategoriesTest
    Start 3: PaginateModelTest
1/3 Test #3: PaginateModelTest ................   Passed    0.06 sec
2/3 Test #2: CategoriesTest ...................   Passed    0.09 sec
3/3 Test #1: knsbackendtest ...................***Exception: SegFault  0.85 sec

67% tests passed, 1 tests failed out of 3

Total Test time (real) =   0.87 sec

The following tests FAILED:
          1 - knsbackendtest (SEGFAULT)
Errors while running CTest

Relevant part of LastTest.log says:
1/3 Testing: knsbackendtest
1/3 Test: knsbackendtest
Command: "/var/tmp/portage/kde-plasma/discover-5.15.5/work/discover-5.15.5_build/bin/knsbackendtest"
Directory: /var/tmp/portage/kde-plasma/discover-5.15.5/work/discover-5.15.5_build/libdiscover/backends/KNSBackend/tests
"knsbackendtest" start time: May 20 14:33 CEST
Output:
----------------------------------------------------------
invalid kns backend! "/etc/xdg/ksysguard.knsrc" because: "Config group not found! Check your KNS3 installation."
invalid kns backend! "/etc/xdg/servicemenu.knsrc" because: "Config group not found! Check your KNS3 installation."
********* Start testing of KNSBackendTest *********
Config: Using QtTest library 5.11.3, Qt 5.11.3 (x86_64-little_endian-lp64 shared (dynamic) release build; by GCC 8.3.0)
PASS   : KNSBackendTest::initTestCase()
QWARN  : KNSBackendTest::testRetrieval() org.kde.knewstuff.core: "Network unreachable"
QDEBUG : KNSBackendTest::testRetrieval() KNS error in "Kate Snippets" : KNSCore::ErrorCode(ProviderError) "Loading of providers from file: http://download.kde.org/ocs/providers.xml failed" QVariant(QString, "http://download.kde.org/ocs/providers.xml")
QWARN  : KNSBackendTest::testRetrieval() invalid kns backend! "/etc/xdg/discover_ktexteditor_codesnippets_core.knsrc" because: "Invalid Kate Snippets backend, contact your distributor."
QWARN  : KNSBackendTest::testRetrieval() org.kde.plasma.libdiscover: Discarding invalid backend "discover_ktexteditor_codesnippets_core.knsrc"
QWARN  : KNSBackendTest::testRetrieval() kns error "/etc/xdg/discover_ktexteditor_codesnippets_core.knsrc" "Invalid Kate Snippets backend, contact your distributor."
QDEBUG : KNSBackendTest::testRetrieval() KNS error in "Katomic" : KNSCore::ErrorCode(ProviderError) "Loading of providers from file: http://download.kde.org/ocs/providers.xml failed" QVariant(QString, "http://download.kde.org/ocs/providers.xml")
QWARN  : KNSBackendTest::testRetrieval() invalid kns backend! "/etc/xdg/katomic.knsrc" because: "Invalid Katomic backend, contact your distributor."
QWARN  : KNSBackendTest::testRetrieval() org.kde.plasma.libdiscover: Discarding invalid backend "katomic.knsrc"
QWARN  : KNSBackendTest::testRetrieval() kns error "/etc/xdg/katomic.knsrc" "Invalid Katomic backend, contact your distributor."
QDEBUG : KNSBackendTest::testRetrieval() KNS error in "Kblocks" : KNSCore::ErrorCode(ProviderError) "Loading of providers from file: http://download.kde.org/ocs/providers.xml failed" QVariant(QString, "http://download.kde.org/ocs/providers.xml")
QWARN  : KNSBackendTest::testRetrieval() invalid kns backend! "/etc/xdg/kblocks.knsrc" because: "Invalid Kblocks backend, contact your distributor."
QWARN  : KNSBackendTest::testRetrieval() org.kde.plasma.libdiscover: Discarding invalid backend "kblocks.knsrc"
QWARN  : KNSBackendTest::testRetrieval() kns error "/etc/xdg/kblocks.knsrc" "Invalid Kblocks backend, contact your distributor."
QDEBUG : KNSBackendTest::testRetrieval() KNS error in "Kdiamond" : KNSCore::ErrorCode(ProviderError) "Loading of providers from file: http://download.kde.org/ocs/providers.xml failed" QVariant(QString, "http://download.kde.org/ocs/providers.xml")
QWARN  : KNSBackendTest::testRetrieval() invalid kns backend! "/etc/xdg/kdiamond.knsrc" because: "Invalid Kdiamond backend, contact your distributor."
QWARN  : KNSBackendTest::testRetrieval() org.kde.plasma.libdiscover: Discarding invalid backend "kdiamond.knsrc"
QWARN  : KNSBackendTest::testRetrieval() kns error "/etc/xdg/kdiamond.knsrc" "Invalid Kdiamond backend, contact your distributor."
QDEBUG : KNSBackendTest::testRetrieval() KNS error in "Kgoldrunner" : KNSCore::ErrorCode(ProviderError) "Loading of providers from file: http://download.kde.org/ocs/providers.xml failed" QVariant(QString, "http://download.kde.org/ocs/providers.xml")
QWARN  : KNSBackendTest::testRetrieval() invalid kns backend! "/etc/xdg/kgoldrunner.knsrc" because: "Invalid Kgoldrunner backend, contact your distributor."
QWARN  : KNSBackendTest::testRetrieval() org.kde.plasma.libdiscover: Discarding invalid backend "kgoldrunner.knsrc"
QWARN  : KNSBackendTest::testRetrieval() kns error "/etc/xdg/kgoldrunner.knsrc" "Invalid Kgoldrunner backend, contact your distributor."
QDEBUG : KNSBackendTest::testRetrieval() KNS error in "Kigo" : KNSCore::ErrorCode(ProviderError) "Loading of providers from file: http://download.kde.org/ocs/providers.xml failed" QVariant(QString, "http://download.kde.org/ocs/providers.xml")
QWARN  : KNSBackendTest::testRetrieval() invalid kns backend! "/etc/xdg/kigo.knsrc" because: "Invalid Kigo backend, contact your distributor."
QWARN  : KNSBackendTest::testRetrieval() org.kde.plasma.libdiscover: Discarding invalid backend "kigo.knsrc"
QWARN  : KNSBackendTest::testRetrieval() kns error "/etc/xdg/kigo.knsrc" "Invalid Kigo backend, contact your distributor."
QDEBUG : KNSBackendTest::testRetrieval() KNS error in "Kigo-games" : KNSCore::ErrorCode(ProviderError) "Loading of providers from file: http://download.kde.org/ocs/providers.xml failed" QVariant(QString, "http://download.kde.org/ocs/providers.xml")
QWARN  : KNSBackendTest::testRetrieval() invalid kns backend! "/etc/xdg/kigo-games.knsrc" because: "Invalid Kigo-games backend, contact your distributor."
QWARN  : KNSBackendTest::testRetrieval() org.kde.plasma.libdiscover: Discarding invalid backend "kigo-games.knsrc"
QWARN  : KNSBackendTest::testRetrieval() kns error "/etc/xdg/kigo-games.knsrc" "Invalid Kigo-games backend, contact your distributor."
QDEBUG : KNSBackendTest::testRetrieval() KNS error in "Ksirk" : KNSCore::ErrorCode(ProviderError) "Loading of providers from file: http://download.kde.org/ocs/providers.xml failed" QVariant(QString, "http://download.kde.org/ocs/providers.xml")
QWARN  : KNSBackendTest::testRetrieval() invalid kns backend! "/etc/xdg/ksirk.knsrc" because: "Invalid Ksirk backend, contact your distributor."
QWARN  : KNSBackendTest::testRetrieval() org.kde.plasma.libdiscover: Discarding invalid backend "ksirk.knsrc"
QWARN  : KNSBackendTest::testRetrieval() kns error "/etc/xdg/ksirk.knsrc" "Invalid Ksirk backend, contact your distributor."
QDEBUG : KNSBackendTest::testRetrieval() KNS error in "Ksnakeduel" : KNSCore::ErrorCode(ProviderError) "Loading of providers from file: http://download.kde.org/ocs/providers.xml failed" QVariant(QString, "http://download.kde.org/ocs/providers.xml")
QWARN  : KNSBackendTest::testRetrieval() invalid kns backend! "/etc/xdg/ksnakeduel.knsrc" because: "Invalid Ksnakeduel backend, contact your distributor."
QWARN  : KNSBackendTest::testRetrieval() org.kde.plasma.libdiscover: Discarding invalid backend "ksnakeduel.knsrc"
QWARN  : KNSBackendTest::testRetrieval() kns error "/etc/xdg/ksnakeduel.knsrc" "Invalid Ksnakeduel backend, contact your distributor."
QDEBUG : KNSBackendTest::testRetrieval() KNS error in "Knights" : KNSCore::ErrorCode(ProviderError) "Loading of providers from file: http://download.kde.org/ocs/providers.xml failed" QVariant(QString, "http://download.kde.org/ocs/providers.xml")
QWARN  : KNSBackendTest::testRetrieval() invalid kns backend! "/etc/xdg/knights.knsrc" because: "Invalid Knights backend, contact your distributor."
QWARN  : KNSBackendTest::testRetrieval() org.kde.plasma.libdiscover: Discarding invalid backend "knights.knsrc"
QWARN  : KNSBackendTest::testRetrieval() kns error "/etc/xdg/knights.knsrc" "Invalid Knights backend, contact your distributor."
QDEBUG : KNSBackendTest::testRetrieval() KNS error in "Kdenlive Render Profiles" : KNSCore::ErrorCode(ProviderError) "Loading of providers from file: http://download.kde.org/ocs/providers.xml failed" QVariant(QString, "http://download.kde.org/ocs/providers.xml")
QWARN  : KNSBackendTest::testRetrieval() invalid kns backend! "/etc/xdg/kdenlive_renderprofiles.knsrc" because: "Invalid Kdenlive Render Profiles backend, contact your distributor."
QWARN  : KNSBackendTest::testRetrieval() org.kde.plasma.libdiscover: Discarding invalid backend "kdenlive_renderprofiles.knsrc"
QWARN  : KNSBackendTest::testRetrieval() kns error "/etc/xdg/kdenlive_renderprofiles.knsrc" "Invalid Kdenlive Render Profiles backend, contact your distributor."
QDEBUG : KNSBackendTest::testRetrieval() KNS error in "Kdenlive Transition Wipes" : KNSCore::ErrorCode(ProviderError) "Loading of providers from file: http://download.kde.org/ocs/providers.xml failed" QVariant(QString, "http://download.kde.org/ocs/providers.xml")
QWARN  : KNSBackendTest::testRetrieval() invalid kns backend! "/etc/xdg/kdenlive_wipes.knsrc" because: "Invalid Kdenlive Transition Wipes backend, contact your distributor."
QWARN  : KNSBackendTest::testRetrieval() org.kde.plasma.libdiscover: Discarding invalid backend "kdenlive_wipes.knsrc"
QWARN  : KNSBackendTest::testRetrieval() kns error "/etc/xdg/kdenlive_wipes.knsrc" "Invalid Kdenlive Transition Wipes backend, contact your distributor."
QDEBUG : KNSBackendTest::testRetrieval() KNS error in "Kdenlive Keyboard Schemes" : KNSCore::ErrorCode(ProviderError) "Loading of providers from file: http://download.kde.org/ocs/providers.xml failed" QVariant(QString, "http://download.kde.org/ocs/providers.xml")
QWARN  : KNSBackendTest::testRetrieval() invalid kns backend! "/etc/xdg/kdenlive_keyboardschemes.knsrc" because: "Invalid Kdenlive Keyboard Schemes backend, contact your distributor."
QWARN  : KNSBackendTest::testRetrieval() org.kde.plasma.libdiscover: Discarding invalid backend "kdenlive_keyboardschemes.knsrc"
QWARN  : KNSBackendTest::testRetrieval() kns error "/etc/xdg/kdenlive_keyboardschemes.knsrc" "Invalid Kdenlive Keyboard Schemes backend, contact your distributor."
QDEBUG : KNSBackendTest::testRetrieval() KNS error in "Kdenlive Title Templates" : KNSCore::ErrorCode(ProviderError) "Loading of providers from file: http://download.kde.org/ocs/providers.xml failed" QVariant(QString, "http://download.kde.org/ocs/providers.xml")
QWARN  : KNSBackendTest::testRetrieval() invalid kns backend! "/etc/xdg/kdenlive_titles.knsrc" because: "Invalid Kdenlive Title Templates backend, contact your distributor."
QWARN  : KNSBackendTest::testRetrieval() org.kde.plasma.libdiscover: Discarding invalid backend "kdenlive_titles.knsrc"
QWARN  : KNSBackendTest::testRetrieval() kns error "/etc/xdg/kdenlive_titles.knsrc" "Invalid Kdenlive Title Templates backend, contact your distributor."
QDEBUG : KNSBackendTest::testRetrieval() KNS error in "K3B Themes" : KNSCore::ErrorCode(ProviderError) "Loading of providers from file: http://download.kde.org/ocs/providers.xml failed" QVariant(QString, "http://download.kde.org/ocs/providers.xml")
QWARN  : KNSBackendTest::testRetrieval() invalid kns backend! "/etc/xdg/k3btheme.knsrc" because: "Invalid K3B Themes backend, contact your distributor."
QWARN  : KNSBackendTest::testRetrieval() org.kde.plasma.libdiscover: Discarding invalid backend "k3btheme.knsrc"
QWARN  : KNSBackendTest::testRetrieval() kns error "/etc/xdg/k3btheme.knsrc" "Invalid K3B Themes backend, contact your distributor."
QDEBUG : KNSBackendTest::testRetrieval() KNS error in "KMail Header Theme" : KNSCore::ErrorCode(ProviderError) "Loading of providers from file: http://download.kde.org/ocs/providers.xml failed" QVariant(QString, "http://download.kde.org/ocs/providers.xml")
QWARN  : KNSBackendTest::testRetrieval() invalid kns backend! "/etc/xdg/messageviewer_header_themes.knsrc" because: "Invalid KMail Header Theme backend, contact your distributor."
QWARN  : KNSBackendTest::testRetrieval() org.kde.plasma.libdiscover: Discarding invalid backend "messageviewer_header_themes.knsrc"
QWARN  : KNSBackendTest::testRetrieval() kns error "/etc/xdg/messageviewer_header_themes.knsrc" "Invalid KMail Header Theme backend, contact your distributor."
PASS   : KNSBackendTest::testRetrieval()
<end of output>
Test time =   0.85 sec
----------------------------------------------------------
Test Failed.
"knsbackendtest" end time: May 20 14:33 CEST
"knsbackendtest" time elapsed: 00:00:00
----------------------------------------------------------
Comment 1 Paolo Pedroni 2019-05-20 13:19:28 UTC
# emerge --info =kde-plasma/discover-5.15.5
Portage 2.3.62 (python 3.6.5-final-0, default/linux/amd64/17.1/desktop/plasma/systemd, gcc-8.3.0, glibc-2.29-r2, 4.19.37-gentoo x86_64)
=================================================================
                         System Settings
=================================================================
System uname: Linux-4.19.37-gentoo-x86_64-AMD_Phenom-tm-_II_X6_1100T_Processor-with-gentoo-2.6
KiB Mem:    12016168 total,   3245848 free
KiB Swap:   12550140 total,  12503292 free
Timestamp of repository gentoo: Mon, 20 May 2019 08:15:01 +0000
Head commit of repository gentoo: d7b0c440727a33d1ceb3111623dac9dfd86170ec
sh dash 0.5.9.1-r3
ld GNU gold (Gentoo 2.31.1 p7 2.31.1) 1.16
distcc 3.3.2 x86_64-pc-linux-gnu [enabled]
ccache version 3.6 [disabled]
app-shells/bash:          4.4_p23-r1::gentoo
dev-java/java-config:     2.2.0-r4::gentoo
dev-lang/perl:            5.26.2::gentoo
dev-lang/python:          2.7.15::gentoo, 3.6.5::gentoo
dev-util/ccache:          3.6::gentoo
dev-util/cmake:           3.14.3::gentoo
dev-util/pkgconfig:       0.29.2::gentoo
sys-apps/baselayout:      2.6-r1::gentoo
sys-apps/sandbox:         2.13::gentoo
sys-devel/autoconf:       2.13-r1::gentoo, 2.69-r4::gentoo
sys-devel/automake:       1.16.1-r1::gentoo
sys-devel/binutils:       2.31.1-r6::gentoo
sys-devel/gcc:            8.3.0-r1::gentoo
sys-devel/gcc-config:     2.0::gentoo
sys-devel/libtool:        2.4.6-r3::gentoo
sys-devel/make:           4.2.1-r4::gentoo
sys-kernel/linux-headers: 4.17::gentoo (virtual/os-headers)
sys-libs/glibc:           2.29-r2::gentoo
Repositories:

gentoo
    location: /usr/portage
    sync-type: rsync
    sync-uri: rsync://rsync.europe.gentoo.org/gentoo-portage
    priority: -1000
    sync-rsync-verify-max-age: 24
    sync-rsync-extra-opts: 
    sync-rsync-verify-jobs: 1
    sync-rsync-verify-metamanifest: yes

x-portage
    location: /usr/local/portage
    masters: gentoo
    priority: 0

ACCEPT_KEYWORDS="amd64"
ACCEPT_LICENSE="* -@EULA"
CBUILD="x86_64-pc-linux-gnu"
CFLAGS="-O2 -pipe -frecord-gcc-switches -march=amdfam10 -flto=7"
CHOST="x86_64-pc-linux-gnu"
CONFIG_PROTECT="/etc /usr/lib64/libreoffice/program/sofficerc /usr/share/config /usr/share/gnupg/qualified.txt"
CONFIG_PROTECT_MASK="/etc/ca-certificates.conf /etc/dconf /etc/env.d /etc/fonts/fonts.conf /etc/gconf /etc/gentoo-release /etc/revdep-rebuild /etc/sandbox.d /etc/terminfo"
CXXFLAGS="-O2 -pipe -frecord-gcc-switches -march=amdfam10 -flto=7"
DISTDIR="/usr/portage/distfiles"
EMERGE_DEFAULT_OPTS="--keep-going y --with-bdeps y"
ENV_UNSET="DBUS_SESSION_BUS_ADDRESS DISPLAY GOBIN PERL5LIB PERL5OPT PERLPREFIX PERL_CORE PERL_MB_OPT PERL_MM_OPT XAUTHORITY XDG_CACHE_HOME XDG_CONFIG_HOME XDG_DATA_HOME XDG_RUNTIME_DIR"
FCFLAGS="-O2 -pipe -frecord-gcc-switches -march=amdfam10 -flto=7"
FEATURES="assume-digests binpkg-docompress binpkg-dostrip binpkg-logs cgroup compress-build-logs config-protect-if-modified distcc distlocks ebuild-locks ipc-sandbox merge-sync multilib-strict network-sandbox news parallel-fetch pid-sandbox preserve-libs protect-owned sandbox sfperms split-elog split-log strict test unknown-features-warn unmerge-logs unmerge-orphans userfetch userpriv usersandbox usersync xattr"
FFLAGS="-O2 -pipe -frecord-gcc-switches -march=amdfam10 -flto=7"
GENTOO_MIRRORS="http://gentoo.modulix.net/gentoo/ http://mirrors.evowise.com/gentoo/ http://ftp.fau.de/gentoo http://gentoo.mirrors.ovh.net/gentoo-distfiles/ http://ftp.snt.utwente.nl/pub/os/linux/gentoo"
LANG="it_IT.UTF-8"
LDFLAGS="-Wl,-O1 -Wl,--as-needed -Wl,--hash-style=gnu -Wl,--sort-common -flto=7"
LINGUAS="it it_IT"
MAKEOPTS="-j15 -l6"
PKGDIR="/usr/portage/packages"
PORTAGE_CONFIGROOT="/"
PORTAGE_RSYNC_OPTS="--recursive --links --safe-links --perms --times --omit-dir-times --compress --force --whole-file --delete --stats --human-readable --timeout=180 --exclude=/distfiles --exclude=/local --exclude=/packages --exclude=/.git"
PORTAGE_TMPDIR="/var/tmp"
USE="X a52 aac aalib acl acpi activities adns alsa amd64 ao audiofile bash-completion bluetooth branding bzip2 cairo caps cdda cddb cdparanoia cdr cli crypt css cups curl cxx dbus declarative dga djvu dri dts dvd dvdr emboss encode exif expat fbcon ffmpeg fftw flac fontconfig fortran ftp gd gdbm geoip gif gimp glamor gmp gnutls gphoto2 gpm graphviz gtk handbook iconv icu idn imagemagick imlib ipv6 java javascript jbig jpeg jpeg2k kde kipi kwallet lame lcms libass libcaca libnotify libsamplerate libtirpc lm_sensors lua lzma lzo mad mmap mng mp3 mp4 mpeg mplayer multilib musicbrainz ncurses nls nptl nsplugin offensive ogg openal opengl openmp pam pango pcre pdf phonon plasma png policykit postscript ppds pulseaudio qml qt5 rdesktop readline recode samba scanner sctp sdl seccomp sndfile sockets speex spell sqlite sqlite3 ssl startup-notification svg symlink syslog systemd sysvipc taglib test theora threads tidy tiff truetype udev udisks unicode upower usb vaapi vcd vdpau vim-syntax vnc vorbis wayland widgets win32codecs wmf wxwidgets x264 xattr xcb xcomposite xine xml xpm xscreensaver xv xvid yahoo zlib" ABI_X86="64" ALSA_CARDS="hda-intel virmidi" APACHE2_MODULES="authn_core authz_core socache_shmcb unixd actions alias auth_basic authn_alias authn_anon authn_dbm authn_default authn_file authz_dbm authz_default authz_groupfile authz_host authz_owner authz_user autoindex cache cgi cgid dav dav_fs dav_lock deflate dir disk_cache env expires ext_filter file_cache filter headers include info log_config logio mem_cache mime mime_magic negotiation rewrite setenvif speling status unique_id userdir usertrack vhost_alias" CALLIGRA_FEATURES="karbon sheets words" CAMERAS="kodak ptp2" COLLECTD_PLUGINS="df interface irq load memory rrdtool swap syslog" CPU_FLAGS_X86="3dnow 3dnowext mmx mmxext popcnt sse sse2 sse3 sse4a" CURL_SSL="gnutls" ELIBC="glibc" GPSD_PROTOCOLS="ashtech aivdm earthmate evermore fv18 garmin garmintxt gpsclock isync itrax mtk3301 nmea ntrip navcom oceanserver oldstyle oncore rtcm104v2 rtcm104v3 sirf skytraq superstar2 timing tsip tripmate tnt ublox ubx" GRUB_PLATFORMS="pc" INPUT_DEVICES="libinput" KERNEL="linux" L10N="it en" LCD_DEVICES="bayrad cfontz cfontz633 glk hd44780 lb216 lcdm001 mtxorb ncurses text" LIBREOFFICE_EXTENSIONS="nlpsolver" NETBEANS_MODULES="apisupport cnd groovy gsf harness ide identity j2ee java mobility nb php profiler soa visualweb webcommon websvccommon xml" OFFICE_IMPLEMENTATION="libreoffice" PHP_TARGETS="php5-6 php7-1" POSTGRES_TARGETS="postgres9_5 postgres10" PYTHON_SINGLE_TARGET="python3_6" PYTHON_TARGETS="python2_7 python3_6 pypy pypy3" RUBY_TARGETS="ruby24" SANE_BACKENDS="epson epson2" USERLAND="GNU" VIDEO_CARDS="radeon r600" XTABLES_ADDONS="quota2 psd pknock lscan length2 ipv4options ipset ipp2p iface geoip fuzzy condition tee tarpit sysrq steal rawnat logmark ipmark dhcpmac delude chaos account"
Unset:  CC, CPPFLAGS, CTARGET, CXX, INSTALL_MASK, LC_ALL, PORTAGE_BINHOST, PORTAGE_BUNZIP2_COMMAND, PORTAGE_COMPRESS, PORTAGE_COMPRESS_FLAGS, PORTAGE_RSYNC_EXTRA_OPTS

=================================================================
                        Package Settings
=================================================================

kde-plasma/discover-5.15.5::gentoo was built with the following:
USE="firmware -debug -test" ABI_X86="(64)"

# emerge -1pqv =kde-plasma/discover-5.15.5
[ebuild   R   ] kde-plasma/discover-5.15.5  USE="firmware test* -debug"
Comment 2 Larry the Git Cow gentoo-dev 2019-05-21 20:31:59 UTC
The bug has been closed via the following commit(s):

https://gitweb.gentoo.org/repo/gentoo.git/commit/?id=94be86e7bc4b710d75d7e12f6af5627ad2ea1c30

commit 94be86e7bc4b710d75d7e12f6af5627ad2ea1c30
Author:     Andreas Sturmlechner <asturm@gentoo.org>
AuthorDate: 2019-05-21 20:31:28 +0000
Commit:     Andreas Sturmlechner <asturm@gentoo.org>
CommitDate: 2019-05-21 20:31:47 +0000

    kde-plasma/discover: Tests hang and/or are broken
    
    Let's try again with next release.
    
    Closes: https://bugs.gentoo.org/686392
    Package-Manager: Portage-2.3.66, Repoman-2.3.12
    Signed-off-by: Andreas Sturmlechner <asturm@gentoo.org>

 kde-plasma/discover/discover-5.15.5.ebuild | 2 ++
 1 file changed, 2 insertions(+)
Comment 3 Larry the Git Cow gentoo-dev 2019-06-05 19:06:33 UTC
The bug has been closed via the following commit(s):

https://gitweb.gentoo.org/proj/kde.git/commit/?id=3697c46930646b08e6bf13fe7ec5879f16e5b06f

commit 3697c46930646b08e6bf13fe7ec5879f16e5b06f
Author:     Andreas Sturmlechner <asturm@gentoo.org>
AuthorDate: 2019-06-05 17:21:20 +0000
Commit:     Andreas Sturmlechner <asturm@gentoo.org>
CommitDate: 2019-06-05 17:21:20 +0000

    kde-plasma/discover: Disable knsbackendtest, needs network connection
    
    Closes: https://bugs.gentoo.org/686392
    Package-Manager: Portage-2.3.66, Repoman-2.3.12
    Signed-off-by: Andreas Sturmlechner <asturm@gentoo.org>

 kde-plasma/discover/discover-5.15.90.ebuild        | 11 +++++--
 kde-plasma/discover/discover-5.16.49.9999.ebuild   | 11 +++++--
 kde-plasma/discover/discover-9999.ebuild           |  9 +++++
 .../discover/files/discover-5.15.5-tests.patch     | 38 ----------------------
 4 files changed, 27 insertions(+), 42 deletions(-)