Gentoo Websites Logo
Go to: Gentoo Home Documentation Forums Lists Bugs Planet Store Wiki Get Gentoo!

Bug 913967

Summary: app-containers/aardvark-dns-1.6.0 fails tests (PYTHON-3.12-SYSTEM): thread test::test::tests::test_backend_network_scoped_custom_dns_server panicked at assertion failed: (left == right)
Product: Gentoo Linux Reporter: Agostino Sarubbo <ago>
Component: Current packagesAssignee: Zac Medico <zmedico>
Status: CONFIRMED ---    
Severity: normal Keywords: TESTFAILURE
Priority: Normal    
Version: unspecified   
Hardware: All   
OS: Linux   
Whiteboard:
Package list:
Runtime testing required: ---
Bug Depends on:    
Bug Blocks: 921826    
Attachments: build.log

Description Agostino Sarubbo gentoo-dev 2023-09-11 07:14:39 UTC
https://blogs.gentoo.org/ago/2020/07/04/gentoo-tinderbox/

Issue: app-containers/aardvark-dns-1.6.0 fails tests (PYTHON-3.12-SYSTEM).
Discovered on: amd64 (internal ref: python-3.12_tinderbox)

NOTE:
(PYTHON-3.12-SYSTEM) in the summary means that the bug was found on a machine that runs python-3.12 but this bug MAY or MAY NOT BE related to the new python version
Comment 1 Agostino Sarubbo gentoo-dev 2023-09-11 07:14:42 UTC
Created attachment 870281 [details]
build.log

build log and emerge --info
Comment 2 Agostino Sarubbo gentoo-dev 2023-09-11 07:14:42 UTC
Error(s) that match a know pattern in addition to what has been reported in the summary:


thread 'test::test::tests::test_backend_network_scoped_custom_dns_server' panicked at 'assertion failed: `(left == right)`
error: test failed, to rerun pass `--bin aardvark-dns`