Gentoo Websites Logo
Go to: Gentoo Home Documentation Forums Lists Bugs Planet Store Wiki Get Gentoo!

Bug 872158

Summary: net-libs/stem-1.8.0_p20211118 fails tests (MUSL): test_compression_lzma - test_exit_used - test_install
Product: Gentoo Linux Reporter: Agostino Sarubbo <ago>
Component: Current packagesAssignee: No maintainer - Look at if you want to take care of it <maintainer-needed>
Status: CONFIRMED ---    
Severity: normal    
Priority: Normal    
Version: unspecified   
Hardware: All   
OS: Linux   
Package list:
Runtime testing required: ---
Attachments: build.log

Description Agostino Sarubbo gentoo-dev 2022-09-21 07:55:33 UTC

Issue: net-libs/stem-1.8.0_p20211118 fails tests (MUSL).
Discovered on: amd64 (internal ref: tinderbox_musl)

This machine uses MUSL libc
Comment 1 Agostino Sarubbo gentoo-dev 2022-09-21 07:55:35 UTC
Created attachment 813223 [details]

build log and emerge --info
Comment 2 Agostino Sarubbo gentoo-dev 2022-09-21 07:55:36 UTC
Error(s) that match a know pattern in addition to what has been reported in the summary:

" != "Trac[49 chars].
AssertionError: "Trac[49 chars].
AssertionError: 1 != 0
AssertionError: Unable to find site-packages, files include:
Exit relay for our connection to 64.15.11[144 chars]
FAIL: test_compression_lzma
FAIL: test_exit_used
FAIL: test_install
FAILED (failures=1, skipped=1)