Gentoo Websites Logo
Go to: Gentoo Home Documentation Forums Lists Bugs Planet Store Wiki Get Gentoo!
Votes Bug # Summary
Gentoo Linux (bug list)
1 552142 dev-libs/apr-1.5.2 fails tests with /bin/sh -> dash (Show Votes)
1 559490 app-text/manpager: arguments in $PAGER are not handled (Show Votes)
1 632164 net-misc/openssh-7.5_p1-r2: failed conch ciphers (Show Votes)
1 632508 dev-util/android-tools - Executing adb as non-root user fails without 80-android.rules from android-sdk-update-manager. (Show Votes)
1 662964 app-office/libreoffice: Error: a unit test failed: Test::TestDrawString: XPath '/primitive2D/metafile/transform/textsimpleportion' number of nodes is incorrect (Show Votes)
1 674458 sys-apps/systemd test-mountpoint-util and test-process-util fail with FEATURES="pid-sandbox" (Show Votes)
1 677926 dev-build/autoconf-2.13-r6 fails tests: FAIL: AC_FUNC_GETLOADAVG, problem with executing (Show Votes)
1 693616 dev-build/autoconf-2.69-r4 fails tests: ERROR: 493 tests were run, (Show Votes)
1 708230 sys-process/procps-3.3.16 fails tests: FAIL: ps SCHED_BATCH scheduler (Show Votes)
1 723114 sys-devel/clang-10.0.0 - .../work/x/y/llvm/utils/lit/lit/formats/googletest.py", line 44, in getGTestTests raise StopIteration (Show Votes)
1 723340 dev-python/secretstorage-3.1.2: test failures: secretstorage.exceptions.SecretServiceNotAvailableException: Message recipient disconnected from message bus without replying (Show Votes)
1 739544 dev-python/pygobject-3.36.1 fails test TestGDBusClient.test_python_calls_sync (Show Votes)
1 775986 net-misc/ntp-4.2.8_p15 fails tests (Show Votes)
1 808849 sys-fs/cryfs-0.10.3-r1 fails tests: - [ FAILED ] 27 tests, listed below: (Show Votes)
1 823770 dev-debug/gdb-11.1 has many test failures (Show Votes)
1 830732 dev-lang/spidermonkey-78.15.0 fails tests: - FAIL (Show Votes)
1 830737 dev-libs/libfmt-9.1.0-r1 fails tests: 2 - assert-test (Show Votes)
1 840167 dev-libs/libnl-3.7.0 fails test - FAIL: tests/check-all (Show Votes)
1 854405 app-accessibility/espeak-ng-1.51 fails tests (Show Votes)
1 856646 gui-libs/gtk-4.6.5: 'vbox-with-2-wrapping-labels-where-one-should-wrap.ui' and 'unaligned-offscreen' test failures (Show Votes)
1 862192 app-office/libreoffice-7.3.4.2-r1 fails tests: Error: Unable to access jarfile (Show Votes)
1 872173 net-mail/mailutils-3.15 fails tests (MUSL) (Show Votes)
1 874627 dev-libs/grantlee-5.3.0 fails test #2 testbuiltins (Show Votes)
1 879153 net-libs/nodejs-18.11.0 fails test - AssertionError [ERR_ASSERTION]: The expression evaluated to a falsy value: (Show Votes)
1 880863 x11-libs/gdk-pixbuf-2.42.10 fails tests: asyncio.exceptions.CancelledError, asyncio.exceptions.TimeoutError (Show Votes)
1 887345 dev-perl/Config-AutoConf-0.320.0 fails tests (Show Votes)
1 890628 net-firewall/iptables-1.8.9 fails tests: FAIL: xlate-test.py (Show Votes)
1 892459 x11-libs/wxGTK-3.2.1 fails test wxUILocale::GetInfo (Show Votes)
1 892621 dev-python/yarl-1.8.2 fails tests (LIBARCHIVE-SYSTEM): FAILED test_url_parsing.py::TestScheme::test_not_a_scheme2 - AssertionError: .. (Show Votes)
1 893810 dev-python/jupyter-client-8.0.2 fails tests (HARDENED-SYSTEM): RuntimeError: Kernel died before replying to kernel_info (Show Votes)
1 895112 dev-db/mariadb-10.6.12 fails unit.pfs test (Show Votes)
1 903347 sys-apps/accountsservice-23.13.9 fails tests: FAIL: test_languages (__main__.Tests.test_languages) (tests fail without en_IE.UTF-8 locale) (Show Votes)
1 907951 app-text/doxygen-1.9.6 (with USE=+doc) fails with: error: Failed to extract bounding box from generated diagram file /var/tmp/portage/app-text/doxygen-1.9.6/work/doxygen-1.9.6_build/latex/examples/diagrams/latex/class_a__coll__graph.pdf (Show Votes)
1 908061 x11-libs/libXpm fails 'XpmWrite 1' test (Show Votes)
1 909553 dev-python/yarl-1.9.2 fails tests (Show Votes)
1 910477 dev-python/polib-1.2.0 fails tests with >=sys-devel/gettext-0.22 (Show Votes)
1 912717 dev-python/pip-23.2.1 fails tests (Show Votes)
1 912814 dev-python/cython-3.0.0-r1 fails tests (Show Votes)
1 914917 dev-util/gtk-doc-1.33.2-r1 fails test - 30/37 test-gobject-mkhtml FAIL 0.70s exit status 6 (Show Votes)
1 917754 dev-python/autocommand-2.2.2 - KeyError: text (Show Votes)
1 917799 dev-lang/go-1.21.4 TestLoopVarInlines Fails exec from /tmp (test should use ${T}/respect TMPDIR) (Show Votes)
1 919052 dev-python/pycurl-7.45.2-r1 tests hang in tests/multi_socket_test.py::MultiSocketTest::test_multi_socket (Show Votes)
1 919242 dev-libs/libx86emu-3.5-r1: failed (test phase): make[1]: ./prepare_test: No such file or directory (Show Votes)
1 921294 dev-python/matplotlib-3.8.2-r1 fails tests: module 'luaotfload-main' not found (Show Votes)
1 923053 dev-python/jupyter-packaging-0.12.3 fails tests: FileNotFoundError: [Errno 2] No such file or directory (Show Votes)
1 923795 dev-python/cryptography-41.0.7 fails 12 tests (Show Votes)
1 924386 app-crypt/gpgme-1.23.2 fails t-json test (Show Votes)
47 votes used out of 50 allowed.

View all as bug list

Help with voting.