Go to:
Gentoo Home
Documentation
Forums
Lists
Bugs
Planet
Store
Wiki
Get Gentoo!
Gentoo's Bugzilla – Attachment 920191 Details for
Bug 950568
dev-build/muon fails 'meson-tests/frameworks/7 gnome' test
Home
|
New
–
[Ex]
|
Browse
|
Search
|
Privacy Policy
|
[?]
|
Reports
|
Requests
|
Help
|
New Account
|
Log In
[x]
|
Forgot Password
Login:
[x]
Build log
build.log (text/x-log), 215.80 KB, created by
Jakov Smolić
on 2025-03-03 23:58:45 UTC
(
hide
)
Description:
Build log
Filename:
MIME Type:
Creator:
Jakov Smolić
Created:
2025-03-03 23:58:45 UTC
Size:
215.80 KB
patch
obsolete
>[32m * [39;49;00mPackage: dev-build/muon-0.4.0:0 >[32m * [39;49;00mRepository: gentoo >[32m * [39;49;00mMaintainer: arsen@gentoo.org >[32m * [39;49;00mUSE: archive curl elibc_glibc kernel_linux libpkgconf riscv test >[32m * [39;49;00mFEATURES: preserve-libs sandbox test userpriv usersandbox >>>> Unpacking source... >>>> Unpacking muon-v0.4.0.tar.gz to /var/tmp/portage/dev-build/muon-0.4.0/work >>>> Unpacking meson-tests-1e565931348f15f3f9b654f46ab4bf5fa009ca4f.tar.gz to /var/tmp/portage/dev-build/muon-0.4.0/work > [32m*[0m mv /var/tmp/portage/dev-build/muon-0.4.0/work/meson-tests-1e565931348f15f3f9b654f46ab4bf5fa009ca4f /var/tmp/portage/dev-build/muon-0.4.0/work/muon-v0.4.0/tests/project/meson-tests >>>> Source unpacked in /var/tmp/portage/dev-build/muon-0.4.0/work >>>> Preparing source in /var/tmp/portage/dev-build/muon-0.4.0/work/muon-v0.4.0 ... >>>> Source prepared. >>>> Configuring source in /var/tmp/portage/dev-build/muon-0.4.0/work/muon-v0.4.0 ... >meson setup -Db_lto=false --libdir lib64 --localstatedir /var/lib --prefix /usr --sysconfdir /etc --wrap-mode nodownload --build.pkg-config-path /usr/share/pkgconfig --pkg-config-path /usr/share/pkgconfig --native-file /var/tmp/portage/dev-build/muon-0.4.0/temp/meson.riscv64-unknown-linux-gnu.lp64d.ini -Db_pch=false -Dwerror=false -Dbuildtype=plain --native-file=/var/tmp/portage/dev-build/muon-0.4.0/temp/program-file.ini -Dlibcurl=enabled -Dlibarchive=enabled -Dlibpkgconf=enabled -Ddocs=enabled -Dtracy=disabled -Dsamurai=disabled -Dreadline=bestline /var/tmp/portage/dev-build/muon-0.4.0/work/muon-v0.4.0 /var/tmp/portage/dev-build/muon-0.4.0/work/muon-0.4.0-build >[1mThe Meson build system[0m >Version: 1.7.0 >Source dir: [1m/var/tmp/portage/dev-build/muon-0.4.0/work/muon-v0.4.0[0m >Build dir: [1m/var/tmp/portage/dev-build/muon-0.4.0/work/muon-0.4.0-build[0m >Build type: [1mnative build[0m >Project name: [1mmuon[0m >Project version: [1m0.4.0[0m >C compiler for the host machine: [1mriscv64-unknown-linux-gnu-gcc[0m (gcc 14.2.1 "riscv64-unknown-linux-gnu-gcc (Gentoo 14.2.1_p20241221 p7) 14.2.1 20241221") >C linker for the host machine: [1mriscv64-unknown-linux-gnu-gcc[0m ld.bfd 2.44 >Host machine cpu family: [1mriscv64[0m >Host machine cpu: [1mriscv64[0m >Program [1mif this exists youre a bad person[0m found: [1;31mNO[0m >Configuring [1mversion.sh[0m using configuration >Compiler for C supports arguments -Wendif-labels: [1;32mYES[0m >Compiler for C supports arguments -Wimplicit-fallthrough=2: [1;32mYES[0m >Compiler for C supports arguments -Winit-self: [1;32mYES[0m >Compiler for C supports arguments -Wlogical-op: [1;32mYES[0m >Compiler for C supports arguments -Wmissing-include-dirs: [1;32mYES[0m >Compiler for C supports arguments -Wno-missing-braces: [1;32mYES[0m >Compiler for C supports arguments -Wno-missing-field-initializers: [1;32mYES[0m >Compiler for C supports arguments -Wno-unused-parameter: [1;32mYES[0m >Compiler for C supports arguments -Wold-style-definition: [1;32mYES[0m >Compiler for C supports arguments -Woverflow: [1;32mYES[0m >Compiler for C supports arguments -Wstrict-aliasing=2: [1;32mYES[0m >Compiler for C supports arguments -Wstrict-prototypes: [1;32mYES[0m >Compiler for C supports arguments -Wundef: [1;32mYES[0m >Compiler for C supports arguments -Wvla: [1;32mYES[0m >Compiler for C supports arguments -fstrict-aliasing: [1;32mYES[0m >Compiler for C supports arguments -std=c99: [1;32mYES[0m >meson.build:103: [1;33mWARNING:[0m Consider using the built-in option for language standard version instead of using "-std=c99". >Configuring [1mversion.c[0m using configuration >Found pkg-config: [1;32mYES[0m [1m(/usr/bin/riscv64-unknown-linux-gnu-pkg-config)[0m [1;34m2.3.0[0m >Run-time dependency [1mlibcurl[0m found: [1;32mYES[0m [36m8.12.1[0m >Run-time dependency [1mlibarchive[0m found: [1;32mYES[0m [36m3.7.7[0m >Run-time dependency [1mlibpkgconf[0m found: [1;32mYES[0m [36m2.3.0[0m >Found CMake: [1m/usr/bin/cmake[0m (3.31.6) >Run-time dependency [1mtinyjson[0m found: [1;31mNO[0m (tried pkgconfig and cmake) >Looking for a fallback subproject for the dependency [1mtinyjson[0m >Building fallback subproject with default_library=static > >Executing subproject [1mtinyjson[0m > >tinyjson| Project name: [1mtiny-json[0m >tinyjson| Project version: [1mundefined[0m >tinyjson| C compiler for the host machine: [1mriscv64-unknown-linux-gnu-gcc[0m (gcc 14.2.1 "riscv64-unknown-linux-gnu-gcc (Gentoo 14.2.1_p20241221 p7) 14.2.1 20241221") >tinyjson| C linker for the host machine: [1mriscv64-unknown-linux-gnu-gcc[0m ld.bfd 2.44 >tinyjson| Build targets in project: [1m3[0m >tinyjson| Subproject [1mtinyjson[0m finished. > >Dependency [1mtinyjson[0m found: [1;32mYES[0m [36mundefined[0m [1;34m(overridden)[0m >Run-time dependency [1mbestline[0m found: [1;31mNO[0m (tried pkgconfig and cmake) >Looking for a fallback subproject for the dependency [1mbestline[0m > >Executing subproject [1mbestline[0m > >bestline| Project name: [1mbestline[0m >bestline| Project version: [1mundefined[0m >bestline| C compiler for the host machine: [1mriscv64-unknown-linux-gnu-gcc[0m (gcc 14.2.1 "riscv64-unknown-linux-gnu-gcc (Gentoo 14.2.1_p20241221 p7) 14.2.1 20241221") >bestline| C linker for the host machine: [1mriscv64-unknown-linux-gnu-gcc[0m ld.bfd 2.44 >bestline| Build targets in project: [1m4[0m >bestline| Subproject [1mbestline[0m finished. > >Dependency [1mbestline[0m found: [1;32mYES[0m [36mundefined[0m [1;34m(overridden)[0m >Dependency [1mtracy[0m skipped: feature [1mtracy[0m disabled >Program [1mpython3[0m found: [1;32mYES[0m (/usr/bin/python3) >Program [1msh[0m found: [1;32mYES[0m (/usr/bin/sh) >Program [1mafl-fuzz[0m found: [1;31mNO[0m >Program [1mninja[0m found: [1;32mYES[0m (/usr/bin/ninja) >Subproject exists but has no meson.build file. >Subproject [1mmeson-tests[0m is buildable: [1;31mNO[0m (disabling) >Program [1mscdoc[0m found: [1;32mYES[0m (/usr/bin/scdoc) >doc/meson.build:39: [1;33mWARNING:[0m meson-docs not found, meson-reference.3 will not be built >Build targets in project: [1m7[0m > >muon [36m0.4.0[0m > > libcurl : true > libarchive : true > libpkgconf : true > bestline : true > docs : true > > [1mSubprojects[0m > bestline : [1;32mYES[0m > meson-tests : [1;31mNO[0m Subproject exists but has no meson.build file. > tinyjson : [1;32mYES[0m > > [1mUser defined options[0m > Native files : /var/tmp/portage/dev-build/muon-0.4.0/temp/meson.riscv64-unknown-linux-gnu.lp64d.ini > /var/tmp/portage/dev-build/muon-0.4.0/temp/program-file.ini > build.pkg_config_path: /usr/share/pkgconfig > b_lto : false > b_pch : false > buildtype : plain > docs : enabled > libarchive : enabled > libcurl : enabled > libdir : lib64 > libpkgconf : enabled > localstatedir : /var/lib > pkg_config_path : /usr/share/pkgconfig > prefix : /usr > readline : bestline > samurai : disabled > sysconfdir : /etc > tracy : disabled > werror : false > wrap_mode : nodownload > >Found ninja-1.12.1 at /usr/bin/ninja >Generating targets: 0% 0/7 [00:00<?, ?it/s]Generating targets: 71% 5/7 [00:00<00:00, 20.87it/s] Writing build.ninja: 0% 0/157 [00:00<?, ?it/s] >>> Source configured. >>>> Compiling source in /var/tmp/portage/dev-build/muon-0.4.0/work/muon-v0.4.0 ... >ninja -v -j32 -l32 >[1/131] riscv64-unknown-linux-gnu-gcc -Itools/embedder.p -Itools -I../muon-v0.4.0/tools -I../muon-v0.4.0/include -fdiagnostics-color=always -D_FILE_OFFSET_BITS=64 -Wall -Winvalid-pch -Wextra -Wpedantic -O2 -pipe -DMUON_PLATFORM_posix -DMUON_ENDIAN=0 -MD -MQ tools/embedder.p/embedder.c.o -MF tools/embedder.p/embedder.c.o.d -o tools/embedder.p/embedder.c.o -c ../muon-v0.4.0/tools/embedder.c >[2/131] riscv64-unknown-linux-gnu-gcc -o tools/embedder tools/embedder.p/embedder.c.o -Wl,--as-needed -Wl,--no-undefined -O2 -pipe -Wl,-O1 -Wl,--as-needed >[3/131] /usr/lib/python-exec/python3.12/meson --internal exe --capture doc/muon.1 --feed ../muon-v0.4.0/doc/muon.1.scd -- /usr/bin/scdoc >[4/131] /usr/lib/python-exec/python3.12/meson --internal exe --capture doc/meson.build.5 --feed ../muon-v0.4.0/doc/meson.build.5.scd -- /usr/bin/scdoc >[5/131] riscv64-unknown-linux-gnu-gcc -Isubprojects/tinyjson/libtiny-json.a.p -Isubprojects/tinyjson -I../muon-v0.4.0/subprojects/tinyjson -fdiagnostics-color=always -D_FILE_OFFSET_BITS=64 -Wall -Winvalid-pch -Wextra -Wpedantic -O2 -pipe -fPIC -MD -MQ subprojects/tinyjson/libtiny-json.a.p/tiny-json.c.o -MF subprojects/tinyjson/libtiny-json.a.p/tiny-json.c.o.d -o subprojects/tinyjson/libtiny-json.a.p/tiny-json.c.o -c ../muon-v0.4.0/subprojects/tinyjson/tiny-json.c >[6/131] rm -f subprojects/tinyjson/libtiny-json.a && riscv64-unknown-linux-gnu-ar csrDT subprojects/tinyjson/libtiny-json.a subprojects/tinyjson/libtiny-json.a.p/tiny-json.c.o >[7/131] /usr/lib/python-exec/python3.12/meson --internal exe --capture src/script/embedded_files.h -- /var/tmp/portage/dev-build/muon-0.4.0/work/muon-0.4.0-build/tools/embedder ../muon-v0.4.0/src/script/commands/copyfile.meson commands/copyfile.meson ../muon-v0.4.0/src/script/commands/coverage.meson commands/coverage.meson ../muon-v0.4.0/src/script/commands/delete_suffix.meson commands/delete_suffix.meson ../muon-v0.4.0/src/script/commands/i18n/gettext.meson commands/i18n/gettext.meson ../muon-v0.4.0/src/script/commands/i18n/itstool.meson commands/i18n/itstool.meson ../muon-v0.4.0/src/script/commands/i18n/msgfmthelper.meson commands/i18n/msgfmthelper.meson ../muon-v0.4.0/src/script/commands/vcs_tagger.meson commands/vcs_tagger.meson ../muon-v0.4.0/src/script/html/docs.html html/docs.html ../muon-v0.4.0/src/script/html/test_out.html html/test_out.html ../muon-v0.4.0/src/script/lib/cmake_prelude.meson lib/cmake_prelude.meson ../muon-v0.4.0/src/script/modules/_test.meson modules/_test.meson ../muon-v0.4.0/src/script/modules/gnome.meson modules/gnome.meson ../muon-v0.4.0/src/script/modules/i18n.meson modules/i18n.meson ../muon-v0.4.0/src/script/options/global.meson options/global.meson ../muon-v0.4.0/src/script/options/per_project.meson options/per_project.meson ../muon-v0.4.0/src/script/python/python_info.py python/python_info.py ../muon-v0.4.0/src/script/runtime/dependencies.meson runtime/dependencies.meson >[8/131] riscv64-unknown-linux-gnu-gcc -Imuon.p -I. -I../muon-v0.4.0 -I../muon-v0.4.0/include -Isubprojects/tinyjson -I../muon-v0.4.0/subprojects/tinyjson -Isubprojects/bestline -I../muon-v0.4.0/subprojects/bestline -Isrc/script -I/usr/include/pkgconf -fdiagnostics-color=always -D_FILE_OFFSET_BITS=64 -Wall -Winvalid-pch -Wextra -Wpedantic -Wendif-labels -Wimplicit-fallthrough=2 -Winit-self -Wlogical-op -Wmissing-include-dirs -Wno-missing-braces -Wno-missing-field-initializers -Wno-unused-parameter -Wold-style-definition -Woverflow -Wstrict-aliasing=2 -Wstrict-prototypes -Wundef -Wvla -fstrict-aliasing -std=c99 -DMUON_BOOTSTRAPPED -O2 -pipe -DMUON_PLATFORM_posix -DMUON_ENDIAN=0 -MD -MQ muon.p/src_backend_ninja_alias_target.c.o -MF muon.p/src_backend_ninja_alias_target.c.o.d -o muon.p/src_backend_ninja_alias_target.c.o -c ../muon-v0.4.0/src/backend/ninja/alias_target.c >[9/131] riscv64-unknown-linux-gnu-gcc -Imuon.p -I. -I../muon-v0.4.0 -I../muon-v0.4.0/include -Isubprojects/tinyjson -I../muon-v0.4.0/subprojects/tinyjson -Isubprojects/bestline -I../muon-v0.4.0/subprojects/bestline -Isrc/script -I/usr/include/pkgconf -fdiagnostics-color=always -D_FILE_OFFSET_BITS=64 -Wall -Winvalid-pch -Wextra -Wpedantic -Wendif-labels -Wimplicit-fallthrough=2 -Winit-self -Wlogical-op -Wmissing-include-dirs -Wno-missing-braces -Wno-missing-field-initializers -Wno-unused-parameter -Wold-style-definition -Woverflow -Wstrict-aliasing=2 -Wstrict-prototypes -Wundef -Wvla -fstrict-aliasing -std=c99 -DMUON_BOOTSTRAPPED -O2 -pipe -DMUON_PLATFORM_posix -DMUON_ENDIAN=0 -MD -MQ muon.p/src_formats_lines.c.o -MF muon.p/src_formats_lines.c.o.d -o muon.p/src_formats_lines.c.o -c ../muon-v0.4.0/src/formats/lines.c >[10/131] riscv64-unknown-linux-gnu-gcc -Imuon.p -I. -I../muon-v0.4.0 -I../muon-v0.4.0/include -Isubprojects/tinyjson -I../muon-v0.4.0/subprojects/tinyjson -Isubprojects/bestline -I../muon-v0.4.0/subprojects/bestline -Isrc/script -I/usr/include/pkgconf -fdiagnostics-color=always -D_FILE_OFFSET_BITS=64 -Wall -Winvalid-pch -Wextra -Wpedantic -Wendif-labels -Wimplicit-fallthrough=2 -Winit-self -Wlogical-op -Wmissing-include-dirs -Wno-missing-braces -Wno-missing-field-initializers -Wno-unused-parameter -Wold-style-definition -Woverflow -Wstrict-aliasing=2 -Wstrict-prototypes -Wundef -Wvla -fstrict-aliasing -std=c99 -DMUON_BOOTSTRAPPED -O2 -pipe -DMUON_PLATFORM_posix -DMUON_ENDIAN=0 -MD -MQ muon.p/src_backend_output.c.o -MF muon.p/src_backend_output.c.o.d -o muon.p/src_backend_output.c.o -c ../muon-v0.4.0/src/backend/output.c >[11/131] riscv64-unknown-linux-gnu-gcc -Imuon.p -I. -I../muon-v0.4.0 -I../muon-v0.4.0/include -Isubprojects/tinyjson -I../muon-v0.4.0/subprojects/tinyjson -Isubprojects/bestline -I../muon-v0.4.0/subprojects/bestline -Isrc/script -I/usr/include/pkgconf -fdiagnostics-color=always -D_FILE_OFFSET_BITS=64 -Wall -Winvalid-pch -Wextra -Wpedantic -Wendif-labels -Wimplicit-fallthrough=2 -Winit-self -Wlogical-op -Wmissing-include-dirs -Wno-missing-braces -Wno-missing-field-initializers -Wno-unused-parameter -Wold-style-definition -Woverflow -Wstrict-aliasing=2 -Wstrict-prototypes -Wundef -Wvla -fstrict-aliasing -std=c99 -DMUON_BOOTSTRAPPED -O2 -pipe -DMUON_PLATFORM_posix -DMUON_ENDIAN=0 -MD -MQ muon.p/src_functions_disabler.c.o -MF muon.p/src_functions_disabler.c.o.d -o muon.p/src_functions_disabler.c.o -c ../muon-v0.4.0/src/functions/disabler.c >[12/131] riscv64-unknown-linux-gnu-gcc -Imuon.p -I. -I../muon-v0.4.0 -I../muon-v0.4.0/include -Isubprojects/tinyjson -I../muon-v0.4.0/subprojects/tinyjson -Isubprojects/bestline -I../muon-v0.4.0/subprojects/bestline -Isrc/script -I/usr/include/pkgconf -fdiagnostics-color=always -D_FILE_OFFSET_BITS=64 -Wall -Winvalid-pch -Wextra -Wpedantic -Wendif-labels -Wimplicit-fallthrough=2 -Winit-self -Wlogical-op -Wmissing-include-dirs -Wno-missing-braces -Wno-missing-field-initializers -Wno-unused-parameter -Wold-style-definition -Woverflow -Wstrict-aliasing=2 -Wstrict-prototypes -Wundef -Wvla -fstrict-aliasing -std=c99 -DMUON_BOOTSTRAPPED -O2 -pipe -DMUON_PLATFORM_posix -DMUON_ENDIAN=0 -MD -MQ muon.p/src_functions_both_libs.c.o -MF muon.p/src_functions_both_libs.c.o.d -o muon.p/src_functions_both_libs.c.o -c ../muon-v0.4.0/src/functions/both_libs.c >[13/131] riscv64-unknown-linux-gnu-gcc -Imuon.p -I. -I../muon-v0.4.0 -I../muon-v0.4.0/include -Isubprojects/tinyjson -I../muon-v0.4.0/subprojects/tinyjson -Isubprojects/bestline -I../muon-v0.4.0/subprojects/bestline -Isrc/script -I/usr/include/pkgconf -fdiagnostics-color=always -D_FILE_OFFSET_BITS=64 -Wall -Winvalid-pch -Wextra -Wpedantic -Wendif-labels -Wimplicit-fallthrough=2 -Winit-self -Wlogical-op -Wmissing-include-dirs -Wno-missing-braces -Wno-missing-field-initializers -Wno-unused-parameter -Wold-style-definition -Woverflow -Wstrict-aliasing=2 -Wstrict-prototypes -Wundef -Wvla -fstrict-aliasing -std=c99 -DMUON_BOOTSTRAPPED -O2 -pipe -DMUON_PLATFORM_posix -DMUON_ENDIAN=0 -MD -MQ muon.p/src_functions_custom_target.c.o -MF muon.p/src_functions_custom_target.c.o.d -o muon.p/src_functions_custom_target.c.o -c ../muon-v0.4.0/src/functions/custom_target.c >[14/131] riscv64-unknown-linux-gnu-gcc -Imuon.p -I. -I../muon-v0.4.0 -I../muon-v0.4.0/include -Isubprojects/tinyjson -I../muon-v0.4.0/subprojects/tinyjson -Isubprojects/bestline -I../muon-v0.4.0/subprojects/bestline -Isrc/script -I/usr/include/pkgconf -fdiagnostics-color=always -D_FILE_OFFSET_BITS=64 -Wall -Winvalid-pch -Wextra -Wpedantic -Wendif-labels -Wimplicit-fallthrough=2 -Winit-self -Wlogical-op -Wmissing-include-dirs -Wno-missing-braces -Wno-missing-field-initializers -Wno-unused-parameter -Wold-style-definition -Woverflow -Wstrict-aliasing=2 -Wstrict-prototypes -Wundef -Wvla -fstrict-aliasing -std=c99 -DMUON_BOOTSTRAPPED -O2 -pipe -DMUON_PLATFORM_posix -DMUON_ENDIAN=0 -MD -MQ muon.p/src_functions_boolean.c.o -MF muon.p/src_functions_boolean.c.o.d -o muon.p/src_functions_boolean.c.o -c ../muon-v0.4.0/src/functions/boolean.c >[15/131] riscv64-unknown-linux-gnu-gcc -Imuon.p -I. -I../muon-v0.4.0 -I../muon-v0.4.0/include -Isubprojects/tinyjson -I../muon-v0.4.0/subprojects/tinyjson -Isubprojects/bestline -I../muon-v0.4.0/subprojects/bestline -Isrc/script -I/usr/include/pkgconf -fdiagnostics-color=always -D_FILE_OFFSET_BITS=64 -Wall -Winvalid-pch -Wextra -Wpedantic -Wendif-labels -Wimplicit-fallthrough=2 -Winit-self -Wlogical-op -Wmissing-include-dirs -Wno-missing-braces -Wno-missing-field-initializers -Wno-unused-parameter -Wold-style-definition -Woverflow -Wstrict-aliasing=2 -Wstrict-prototypes -Wundef -Wvla -fstrict-aliasing -std=c99 -DMUON_BOOTSTRAPPED -O2 -pipe -DMUON_PLATFORM_posix -DMUON_ENDIAN=0 -MD -MQ muon.p/src_formats_tap.c.o -MF muon.p/src_formats_tap.c.o.d -o muon.p/src_formats_tap.c.o -c ../muon-v0.4.0/src/formats/tap.c >[16/131] riscv64-unknown-linux-gnu-gcc -Imuon.p -I. -I../muon-v0.4.0 -I../muon-v0.4.0/include -Isubprojects/tinyjson -I../muon-v0.4.0/subprojects/tinyjson -Isubprojects/bestline -I../muon-v0.4.0/subprojects/bestline -Isrc/script -I/usr/include/pkgconf -fdiagnostics-color=always -D_FILE_OFFSET_BITS=64 -Wall -Winvalid-pch -Wextra -Wpedantic -Wendif-labels -Wimplicit-fallthrough=2 -Winit-self -Wlogical-op -Wmissing-include-dirs -Wno-missing-braces -Wno-missing-field-initializers -Wno-unused-parameter -Wold-style-definition -Woverflow -Wstrict-aliasing=2 -Wstrict-prototypes -Wundef -Wvla -fstrict-aliasing -std=c99 -DMUON_BOOTSTRAPPED -O2 -pipe -DMUON_PLATFORM_posix -DMUON_ENDIAN=0 -MD -MQ muon.p/src_datastructures_stack.c.o -MF muon.p/src_datastructures_stack.c.o.d -o muon.p/src_datastructures_stack.c.o -c ../muon-v0.4.0/src/datastructures/stack.c >[17/131] riscv64-unknown-linux-gnu-gcc -Imuon.p -I. -I../muon-v0.4.0 -I../muon-v0.4.0/include -Isubprojects/tinyjson -I../muon-v0.4.0/subprojects/tinyjson -Isubprojects/bestline -I../muon-v0.4.0/subprojects/bestline -Isrc/script -I/usr/include/pkgconf -fdiagnostics-color=always -D_FILE_OFFSET_BITS=64 -Wall -Winvalid-pch -Wextra -Wpedantic -Wendif-labels -Wimplicit-fallthrough=2 -Winit-self -Wlogical-op -Wmissing-include-dirs -Wno-missing-braces -Wno-missing-field-initializers -Wno-unused-parameter -Wold-style-definition -Woverflow -Wstrict-aliasing=2 -Wstrict-prototypes -Wundef -Wvla -fstrict-aliasing -std=c99 -DMUON_BOOTSTRAPPED -O2 -pipe -DMUON_PLATFORM_posix -DMUON_ENDIAN=0 -MD -MQ muon.p/src_backend_ninja_coverage.c.o -MF muon.p/src_backend_ninja_coverage.c.o.d -o muon.p/src_backend_ninja_coverage.c.o -c ../muon-v0.4.0/src/backend/ninja/coverage.c >[18/131] riscv64-unknown-linux-gnu-gcc -Imuon.p -I. -I../muon-v0.4.0 -I../muon-v0.4.0/include -Isubprojects/tinyjson -I../muon-v0.4.0/subprojects/tinyjson -Isubprojects/bestline -I../muon-v0.4.0/subprojects/bestline -Isrc/script -I/usr/include/pkgconf -fdiagnostics-color=always -D_FILE_OFFSET_BITS=64 -Wall -Winvalid-pch -Wextra -Wpedantic -Wendif-labels -Wimplicit-fallthrough=2 -Winit-self -Wlogical-op -Wmissing-include-dirs -Wno-missing-braces -Wno-missing-field-initializers -Wno-unused-parameter -Wold-style-definition -Woverflow -Wstrict-aliasing=2 -Wstrict-prototypes -Wundef -Wvla -fstrict-aliasing -std=c99 -DMUON_BOOTSTRAPPED -O2 -pipe -DMUON_PLATFORM_posix -DMUON_ENDIAN=0 -MD -MQ muon.p/src_datastructures_bucket_arr.c.o -MF muon.p/src_datastructures_bucket_arr.c.o.d -o muon.p/src_datastructures_bucket_arr.c.o -c ../muon-v0.4.0/src/datastructures/bucket_arr.c >[19/131] riscv64-unknown-linux-gnu-gcc -Imuon.p -I. -I../muon-v0.4.0 -I../muon-v0.4.0/include -Isubprojects/tinyjson -I../muon-v0.4.0/subprojects/tinyjson -Isubprojects/bestline -I../muon-v0.4.0/subprojects/bestline -Isrc/script -I/usr/include/pkgconf -fdiagnostics-color=always -D_FILE_OFFSET_BITS=64 -Wall -Winvalid-pch -Wextra -Wpedantic -Wendif-labels -Wimplicit-fallthrough=2 -Winit-self -Wlogical-op -Wmissing-include-dirs -Wno-missing-braces -Wno-missing-field-initializers -Wno-unused-parameter -Wold-style-definition -Woverflow -Wstrict-aliasing=2 -Wstrict-prototypes -Wundef -Wvla -fstrict-aliasing -std=c99 -DMUON_BOOTSTRAPPED -O2 -pipe -DMUON_PLATFORM_posix -DMUON_ENDIAN=0 -MD -MQ muon.p/src_functions_dict.c.o -MF muon.p/src_functions_dict.c.o.d -o muon.p/src_functions_dict.c.o -c ../muon-v0.4.0/src/functions/dict.c >[20/131] riscv64-unknown-linux-gnu-gcc -Imuon.p -I. -I../muon-v0.4.0 -I../muon-v0.4.0/include -Isubprojects/tinyjson -I../muon-v0.4.0/subprojects/tinyjson -Isubprojects/bestline -I../muon-v0.4.0/subprojects/bestline -Isrc/script -I/usr/include/pkgconf -fdiagnostics-color=always -D_FILE_OFFSET_BITS=64 -Wall -Winvalid-pch -Wextra -Wpedantic -Wendif-labels -Wimplicit-fallthrough=2 -Winit-self -Wlogical-op -Wmissing-include-dirs -Wno-missing-braces -Wno-missing-field-initializers -Wno-unused-parameter -Wold-style-definition -Woverflow -Wstrict-aliasing=2 -Wstrict-prototypes -Wundef -Wvla -fstrict-aliasing -std=c99 -DMUON_BOOTSTRAPPED -O2 -pipe -DMUON_PLATFORM_posix -DMUON_ENDIAN=0 -MD -MQ muon.p/src_formats_ini.c.o -MF muon.p/src_formats_ini.c.o.d -o muon.p/src_formats_ini.c.o -c ../muon-v0.4.0/src/formats/ini.c >[21/131] riscv64-unknown-linux-gnu-gcc -Imuon.p -I. -I../muon-v0.4.0 -I../muon-v0.4.0/include -Isubprojects/tinyjson -I../muon-v0.4.0/subprojects/tinyjson -Isubprojects/bestline -I../muon-v0.4.0/subprojects/bestline -Isrc/script -I/usr/include/pkgconf -fdiagnostics-color=always -D_FILE_OFFSET_BITS=64 -Wall -Winvalid-pch -Wextra -Wpedantic -Wendif-labels -Wimplicit-fallthrough=2 -Winit-self -Wlogical-op -Wmissing-include-dirs -Wno-missing-braces -Wno-missing-field-initializers -Wno-unused-parameter -Wold-style-definition -Woverflow -Wstrict-aliasing=2 -Wstrict-prototypes -Wundef -Wvla -fstrict-aliasing -std=c99 -DMUON_BOOTSTRAPPED -O2 -pipe -DMUON_PLATFORM_posix -DMUON_ENDIAN=0 -MD -MQ muon.p/src_functions_array.c.o -MF muon.p/src_functions_array.c.o.d -o muon.p/src_functions_array.c.o -c ../muon-v0.4.0/src/functions/array.c >[22/131] riscv64-unknown-linux-gnu-gcc -Imuon.p -I. -I../muon-v0.4.0 -I../muon-v0.4.0/include -Isubprojects/tinyjson -I../muon-v0.4.0/subprojects/tinyjson -Isubprojects/bestline -I../muon-v0.4.0/subprojects/bestline -Isrc/script -I/usr/include/pkgconf -fdiagnostics-color=always -D_FILE_OFFSET_BITS=64 -Wall -Winvalid-pch -Wextra -Wpedantic -Wendif-labels -Wimplicit-fallthrough=2 -Winit-self -Wlogical-op -Wmissing-include-dirs -Wno-missing-braces -Wno-missing-field-initializers -Wno-unused-parameter -Wold-style-definition -Woverflow -Wstrict-aliasing=2 -Wstrict-prototypes -Wundef -Wvla -fstrict-aliasing -std=c99 -DMUON_BOOTSTRAPPED -O2 -pipe -DMUON_PLATFORM_posix -DMUON_ENDIAN=0 -MD -MQ muon.p/src_backend_ninja_custom_target.c.o -MF muon.p/src_backend_ninja_custom_target.c.o.d -o muon.p/src_backend_ninja_custom_target.c.o -c ../muon-v0.4.0/src/backend/ninja/custom_target.c >[23/131] riscv64-unknown-linux-gnu-gcc -Imuon.p -I. -I../muon-v0.4.0 -I../muon-v0.4.0/include -Isubprojects/tinyjson -I../muon-v0.4.0/subprojects/tinyjson -Isubprojects/bestline -I../muon-v0.4.0/subprojects/bestline -Isrc/script -I/usr/include/pkgconf -fdiagnostics-color=always -D_FILE_OFFSET_BITS=64 -Wall -Winvalid-pch -Wextra -Wpedantic -Wendif-labels -Wimplicit-fallthrough=2 -Winit-self -Wlogical-op -Wmissing-include-dirs -Wno-missing-braces -Wno-missing-field-initializers -Wno-unused-parameter -Wold-style-definition -Woverflow -Wstrict-aliasing=2 -Wstrict-prototypes -Wundef -Wvla -fstrict-aliasing -std=c99 -DMUON_BOOTSTRAPPED -O2 -pipe -DMUON_PLATFORM_posix -DMUON_ENDIAN=0 -MD -MQ muon.p/src_backend_backend.c.o -MF muon.p/src_backend_backend.c.o.d -o muon.p/src_backend_backend.c.o -c ../muon-v0.4.0/src/backend/backend.c >[24/131] riscv64-unknown-linux-gnu-gcc -Imuon.p -I. -I../muon-v0.4.0 -I../muon-v0.4.0/include -Isubprojects/tinyjson -I../muon-v0.4.0/subprojects/tinyjson -Isubprojects/bestline -I../muon-v0.4.0/subprojects/bestline -Isrc/script -I/usr/include/pkgconf -fdiagnostics-color=always -D_FILE_OFFSET_BITS=64 -Wall -Winvalid-pch -Wextra -Wpedantic -Wendif-labels -Wimplicit-fallthrough=2 -Winit-self -Wlogical-op -Wmissing-include-dirs -Wno-missing-braces -Wno-missing-field-initializers -Wno-unused-parameter -Wold-style-definition -Woverflow -Wstrict-aliasing=2 -Wstrict-prototypes -Wundef -Wvla -fstrict-aliasing -std=c99 -DMUON_BOOTSTRAPPED -O2 -pipe -DMUON_PLATFORM_posix -DMUON_ENDIAN=0 -MD -MQ muon.p/src_datastructures_arr.c.o -MF muon.p/src_datastructures_arr.c.o.d -o muon.p/src_datastructures_arr.c.o -c ../muon-v0.4.0/src/datastructures/arr.c >[25/131] riscv64-unknown-linux-gnu-gcc -Imuon.p -I. -I../muon-v0.4.0 -I../muon-v0.4.0/include -Isubprojects/tinyjson -I../muon-v0.4.0/subprojects/tinyjson -Isubprojects/bestline -I../muon-v0.4.0/subprojects/bestline -Isrc/script -I/usr/include/pkgconf -fdiagnostics-color=always -D_FILE_OFFSET_BITS=64 -Wall -Winvalid-pch -Wextra -Wpedantic -Wendif-labels -Wimplicit-fallthrough=2 -Winit-self -Wlogical-op -Wmissing-include-dirs -Wno-missing-braces -Wno-missing-field-initializers -Wno-unused-parameter -Wold-style-definition -Woverflow -Wstrict-aliasing=2 -Wstrict-prototypes -Wundef -Wvla -fstrict-aliasing -std=c99 -DMUON_BOOTSTRAPPED -O2 -pipe -DMUON_PLATFORM_posix -DMUON_ENDIAN=0 -MD -MQ muon.p/src_functions_configuration_data.c.o -MF muon.p/src_functions_configuration_data.c.o.d -o muon.p/src_functions_configuration_data.c.o -c ../muon-v0.4.0/src/functions/configuration_data.c >[26/131] riscv64-unknown-linux-gnu-gcc -Imuon.p -I. -I../muon-v0.4.0 -I../muon-v0.4.0/include -Isubprojects/tinyjson -I../muon-v0.4.0/subprojects/tinyjson -Isubprojects/bestline -I../muon-v0.4.0/subprojects/bestline -Isrc/script -I/usr/include/pkgconf -fdiagnostics-color=always -D_FILE_OFFSET_BITS=64 -Wall -Winvalid-pch -Wextra -Wpedantic -Wendif-labels -Wimplicit-fallthrough=2 -Winit-self -Wlogical-op -Wmissing-include-dirs -Wno-missing-braces -Wno-missing-field-initializers -Wno-unused-parameter -Wold-style-definition -Woverflow -Wstrict-aliasing=2 -Wstrict-prototypes -Wundef -Wvla -fstrict-aliasing -std=c99 -DMUON_BOOTSTRAPPED -O2 -pipe -DMUON_PLATFORM_posix -DMUON_ENDIAN=0 -MD -MQ muon.p/src_formats_xml.c.o -MF muon.p/src_formats_xml.c.o.d -o muon.p/src_formats_xml.c.o -c ../muon-v0.4.0/src/formats/xml.c >[27/131] riscv64-unknown-linux-gnu-gcc -Imuon.p -I. -I../muon-v0.4.0 -I../muon-v0.4.0/include -Isubprojects/tinyjson -I../muon-v0.4.0/subprojects/tinyjson -Isubprojects/bestline -I../muon-v0.4.0/subprojects/bestline -Isrc/script -I/usr/include/pkgconf -fdiagnostics-color=always -D_FILE_OFFSET_BITS=64 -Wall -Winvalid-pch -Wextra -Wpedantic -Wendif-labels -Wimplicit-fallthrough=2 -Winit-self -Wlogical-op -Wmissing-include-dirs -Wno-missing-braces -Wno-missing-field-initializers -Wno-unused-parameter -Wold-style-definition -Woverflow -Wstrict-aliasing=2 -Wstrict-prototypes -Wundef -Wvla -fstrict-aliasing -std=c99 -DMUON_BOOTSTRAPPED -O2 -pipe -DMUON_PLATFORM_posix -DMUON_ENDIAN=0 -MD -MQ muon.p/src_backend_ninja.c.o -MF muon.p/src_backend_ninja.c.o.d -o muon.p/src_backend_ninja.c.o -c ../muon-v0.4.0/src/backend/ninja.c >[28/131] riscv64-unknown-linux-gnu-gcc -Imuon.p -I. -I../muon-v0.4.0 -I../muon-v0.4.0/include -Isubprojects/tinyjson -I../muon-v0.4.0/subprojects/tinyjson -Isubprojects/bestline -I../muon-v0.4.0/subprojects/bestline -Isrc/script -I/usr/include/pkgconf -fdiagnostics-color=always -D_FILE_OFFSET_BITS=64 -Wall -Winvalid-pch -Wextra -Wpedantic -Wendif-labels -Wimplicit-fallthrough=2 -Winit-self -Wlogical-op -Wmissing-include-dirs -Wno-missing-braces -Wno-missing-field-initializers -Wno-unused-parameter -Wold-style-definition -Woverflow -Wstrict-aliasing=2 -Wstrict-prototypes -Wundef -Wvla -fstrict-aliasing -std=c99 -DMUON_BOOTSTRAPPED -O2 -pipe -DMUON_PLATFORM_posix -DMUON_ENDIAN=0 -MD -MQ muon.p/src_functions_environment.c.o -MF muon.p/src_functions_environment.c.o.d -o muon.p/src_functions_environment.c.o -c ../muon-v0.4.0/src/functions/environment.c >[29/131] riscv64-unknown-linux-gnu-gcc -Imuon.p -I. -I../muon-v0.4.0 -I../muon-v0.4.0/include -Isubprojects/tinyjson -I../muon-v0.4.0/subprojects/tinyjson -Isubprojects/bestline -I../muon-v0.4.0/subprojects/bestline -Isrc/script -I/usr/include/pkgconf -fdiagnostics-color=always -D_FILE_OFFSET_BITS=64 -Wall -Winvalid-pch -Wextra -Wpedantic -Wendif-labels -Wimplicit-fallthrough=2 -Winit-self -Wlogical-op -Wmissing-include-dirs -Wno-missing-braces -Wno-missing-field-initializers -Wno-unused-parameter -Wold-style-definition -Woverflow -Wstrict-aliasing=2 -Wstrict-prototypes -Wundef -Wvla -fstrict-aliasing -std=c99 -DMUON_BOOTSTRAPPED -O2 -pipe -DMUON_PLATFORM_posix -DMUON_ENDIAN=0 -MD -MQ muon.p/src_functions_external_program.c.o -MF muon.p/src_functions_external_program.c.o.d -o muon.p/src_functions_external_program.c.o -c ../muon-v0.4.0/src/functions/external_program.c >[30/131] riscv64-unknown-linux-gnu-gcc -Imuon.p -I. -I../muon-v0.4.0 -I../muon-v0.4.0/include -Isubprojects/tinyjson -I../muon-v0.4.0/subprojects/tinyjson -Isubprojects/bestline -I../muon-v0.4.0/subprojects/bestline -Isrc/script -I/usr/include/pkgconf -fdiagnostics-color=always -D_FILE_OFFSET_BITS=64 -Wall -Winvalid-pch -Wextra -Wpedantic -Wendif-labels -Wimplicit-fallthrough=2 -Winit-self -Wlogical-op -Wmissing-include-dirs -Wno-missing-braces -Wno-missing-field-initializers -Wno-unused-parameter -Wold-style-definition -Woverflow -Wstrict-aliasing=2 -Wstrict-prototypes -Wundef -Wvla -fstrict-aliasing -std=c99 -DMUON_BOOTSTRAPPED -O2 -pipe -DMUON_PLATFORM_posix -DMUON_ENDIAN=0 -MD -MQ muon.p/src_datastructures_hash.c.o -MF muon.p/src_datastructures_hash.c.o.d -o muon.p/src_datastructures_hash.c.o -c ../muon-v0.4.0/src/datastructures/hash.c >[31/131] riscv64-unknown-linux-gnu-gcc -Imuon.p -I. -I../muon-v0.4.0 -I../muon-v0.4.0/include -Isubprojects/tinyjson -I../muon-v0.4.0/subprojects/tinyjson -Isubprojects/bestline -I../muon-v0.4.0/subprojects/bestline -Isrc/script -I/usr/include/pkgconf -fdiagnostics-color=always -D_FILE_OFFSET_BITS=64 -Wall -Winvalid-pch -Wextra -Wpedantic -Wendif-labels -Wimplicit-fallthrough=2 -Winit-self -Wlogical-op -Wmissing-include-dirs -Wno-missing-braces -Wno-missing-field-initializers -Wno-unused-parameter -Wold-style-definition -Woverflow -Wstrict-aliasing=2 -Wstrict-prototypes -Wundef -Wvla -fstrict-aliasing -std=c99 -DMUON_BOOTSTRAPPED -O2 -pipe -DMUON_PLATFORM_posix -DMUON_ENDIAN=0 -MD -MQ muon.p/src_functions_dependency.c.o -MF muon.p/src_functions_dependency.c.o.d -o muon.p/src_functions_dependency.c.o -c ../muon-v0.4.0/src/functions/dependency.c >[32/131] riscv64-unknown-linux-gnu-gcc -Imuon.p -I. -I../muon-v0.4.0 -I../muon-v0.4.0/include -Isubprojects/tinyjson -I../muon-v0.4.0/subprojects/tinyjson -Isubprojects/bestline -I../muon-v0.4.0/subprojects/bestline -Isrc/script -I/usr/include/pkgconf -fdiagnostics-color=always -D_FILE_OFFSET_BITS=64 -Wall -Winvalid-pch -Wextra -Wpedantic -Wendif-labels -Wimplicit-fallthrough=2 -Winit-self -Wlogical-op -Wmissing-include-dirs -Wno-missing-braces -Wno-missing-field-initializers -Wno-unused-parameter -Wold-style-definition -Woverflow -Wstrict-aliasing=2 -Wstrict-prototypes -Wundef -Wvla -fstrict-aliasing -std=c99 -DMUON_BOOTSTRAPPED -O2 -pipe -DMUON_PLATFORM_posix -DMUON_ENDIAN=0 -MD -MQ muon.p/src_functions_build_target.c.o -MF muon.p/src_functions_build_target.c.o.d -o muon.p/src_functions_build_target.c.o -c ../muon-v0.4.0/src/functions/build_target.c >[33/131] riscv64-unknown-linux-gnu-gcc -Imuon.p -I. -I../muon-v0.4.0 -I../muon-v0.4.0/include -Isubprojects/tinyjson -I../muon-v0.4.0/subprojects/tinyjson -Isubprojects/bestline -I../muon-v0.4.0/subprojects/bestline -Isrc/script -I/usr/include/pkgconf -fdiagnostics-color=always -D_FILE_OFFSET_BITS=64 -Wall -Winvalid-pch -Wextra -Wpedantic -Wendif-labels -Wimplicit-fallthrough=2 -Winit-self -Wlogical-op -Wmissing-include-dirs -Wno-missing-braces -Wno-missing-field-initializers -Wno-unused-parameter -Wold-style-definition -Woverflow -Wstrict-aliasing=2 -Wstrict-prototypes -Wundef -Wvla -fstrict-aliasing -std=c99 -DMUON_BOOTSTRAPPED -O2 -pipe -DMUON_PLATFORM_posix -DMUON_ENDIAN=0 -MD -MQ muon.p/src_functions_file.c.o -MF muon.p/src_functions_file.c.o.d -o muon.p/src_functions_file.c.o -c ../muon-v0.4.0/src/functions/file.c >[34/131] riscv64-unknown-linux-gnu-gcc -Imuon.p -I. -I../muon-v0.4.0 -I../muon-v0.4.0/include -Isubprojects/tinyjson -I../muon-v0.4.0/subprojects/tinyjson -Isubprojects/bestline -I../muon-v0.4.0/subprojects/bestline -Isrc/script -I/usr/include/pkgconf -fdiagnostics-color=always -D_FILE_OFFSET_BITS=64 -Wall -Winvalid-pch -Wextra -Wpedantic -Wendif-labels -Wimplicit-fallthrough=2 -Winit-self -Wlogical-op -Wmissing-include-dirs -Wno-missing-braces -Wno-missing-field-initializers -Wno-unused-parameter -Wold-style-definition -Woverflow -Wstrict-aliasing=2 -Wstrict-prototypes -Wundef -Wvla -fstrict-aliasing -std=c99 -DMUON_BOOTSTRAPPED -O2 -pipe -DMUON_PLATFORM_posix -DMUON_ENDIAN=0 -MD -MQ muon.p/src_functions_feature_opt.c.o -MF muon.p/src_functions_feature_opt.c.o.d -o muon.p/src_functions_feature_opt.c.o -c ../muon-v0.4.0/src/functions/feature_opt.c >[35/131] riscv64-unknown-linux-gnu-gcc -Imuon.p -I. -I../muon-v0.4.0 -I../muon-v0.4.0/include -Isubprojects/tinyjson -I../muon-v0.4.0/subprojects/tinyjson -Isubprojects/bestline -I../muon-v0.4.0/subprojects/bestline -Isrc/script -I/usr/include/pkgconf -fdiagnostics-color=always -D_FILE_OFFSET_BITS=64 -Wall -Winvalid-pch -Wextra -Wpedantic -Wendif-labels -Wimplicit-fallthrough=2 -Winit-self -Wlogical-op -Wmissing-include-dirs -Wno-missing-braces -Wno-missing-field-initializers -Wno-unused-parameter -Wold-style-definition -Woverflow -Wstrict-aliasing=2 -Wstrict-prototypes -Wundef -Wvla -fstrict-aliasing -std=c99 -DMUON_BOOTSTRAPPED -O2 -pipe -DMUON_PLATFORM_posix -DMUON_ENDIAN=0 -MD -MQ muon.p/src_formats_editorconfig.c.o -MF muon.p/src_formats_editorconfig.c.o.d -o muon.p/src_formats_editorconfig.c.o -c ../muon-v0.4.0/src/formats/editorconfig.c >[36/131] riscv64-unknown-linux-gnu-gcc -Imuon.p -I. -I../muon-v0.4.0 -I../muon-v0.4.0/include -Isubprojects/tinyjson -I../muon-v0.4.0/subprojects/tinyjson -Isubprojects/bestline -I../muon-v0.4.0/subprojects/bestline -Isrc/script -I/usr/include/pkgconf -fdiagnostics-color=always -D_FILE_OFFSET_BITS=64 -Wall -Winvalid-pch -Wextra -Wpedantic -Wendif-labels -Wimplicit-fallthrough=2 -Winit-self -Wlogical-op -Wmissing-include-dirs -Wno-missing-braces -Wno-missing-field-initializers -Wno-unused-parameter -Wold-style-definition -Woverflow -Wstrict-aliasing=2 -Wstrict-prototypes -Wundef -Wvla -fstrict-aliasing -std=c99 -DMUON_BOOTSTRAPPED -O2 -pipe -DMUON_PLATFORM_posix -DMUON_ENDIAN=0 -MD -MQ muon.p/src_backend_ninja_build_target.c.o -MF muon.p/src_backend_ninja_build_target.c.o.d -o muon.p/src_backend_ninja_build_target.c.o -c ../muon-v0.4.0/src/backend/ninja/build_target.c >[37/131] riscv64-unknown-linux-gnu-gcc -Imuon.p -I. -I../muon-v0.4.0 -I../muon-v0.4.0/include -Isubprojects/tinyjson -I../muon-v0.4.0/subprojects/tinyjson -Isubprojects/bestline -I../muon-v0.4.0/subprojects/bestline -Isrc/script -I/usr/include/pkgconf -fdiagnostics-color=always -D_FILE_OFFSET_BITS=64 -Wall -Winvalid-pch -Wextra -Wpedantic -Wendif-labels -Wimplicit-fallthrough=2 -Winit-self -Wlogical-op -Wmissing-include-dirs -Wno-missing-braces -Wno-missing-field-initializers -Wno-unused-parameter -Wold-style-definition -Woverflow -Wstrict-aliasing=2 -Wstrict-prototypes -Wundef -Wvla -fstrict-aliasing -std=c99 -DMUON_BOOTSTRAPPED -O2 -pipe -DMUON_PLATFORM_posix -DMUON_ENDIAN=0 -MD -MQ muon.p/src_functions_modules_keyval.c.o -MF muon.p/src_functions_modules_keyval.c.o.d -o muon.p/src_functions_modules_keyval.c.o -c ../muon-v0.4.0/src/functions/modules/keyval.c >[38/131] riscv64-unknown-linux-gnu-gcc -Imuon.p -I. -I../muon-v0.4.0 -I../muon-v0.4.0/include -Isubprojects/tinyjson -I../muon-v0.4.0/subprojects/tinyjson -Isubprojects/bestline -I../muon-v0.4.0/subprojects/bestline -Isrc/script -I/usr/include/pkgconf -fdiagnostics-color=always -D_FILE_OFFSET_BITS=64 -Wall -Winvalid-pch -Wextra -Wpedantic -Wendif-labels -Wimplicit-fallthrough=2 -Winit-self -Wlogical-op -Wmissing-include-dirs -Wno-missing-braces -Wno-missing-field-initializers -Wno-unused-parameter -Wold-style-definition -Woverflow -Wstrict-aliasing=2 -Wstrict-prototypes -Wundef -Wvla -fstrict-aliasing -std=c99 -DMUON_BOOTSTRAPPED -O2 -pipe -DMUON_PLATFORM_posix -DMUON_ENDIAN=0 -MD -MQ muon.p/src_functions_machine.c.o -MF muon.p/src_functions_machine.c.o.d -o muon.p/src_functions_machine.c.o -c ../muon-v0.4.0/src/functions/machine.c >[39/131] riscv64-unknown-linux-gnu-gcc -Imuon.p -I. -I../muon-v0.4.0 -I../muon-v0.4.0/include -Isubprojects/tinyjson -I../muon-v0.4.0/subprojects/tinyjson -Isubprojects/bestline -I../muon-v0.4.0/subprojects/bestline -Isrc/script -I/usr/include/pkgconf -fdiagnostics-color=always -D_FILE_OFFSET_BITS=64 -Wall -Winvalid-pch -Wextra -Wpedantic -Wendif-labels -Wimplicit-fallthrough=2 -Winit-self -Wlogical-op -Wmissing-include-dirs -Wno-missing-braces -Wno-missing-field-initializers -Wno-unused-parameter -Wold-style-definition -Woverflow -Wstrict-aliasing=2 -Wstrict-prototypes -Wundef -Wvla -fstrict-aliasing -std=c99 -DMUON_BOOTSTRAPPED -O2 -pipe -DMUON_PLATFORM_posix -DMUON_ENDIAN=0 -MD -MQ muon.p/src_functions_modules_sourceset.c.o -MF muon.p/src_functions_modules_sourceset.c.o.d -o muon.p/src_functions_modules_sourceset.c.o -c ../muon-v0.4.0/src/functions/modules/sourceset.c >[40/131] riscv64-unknown-linux-gnu-gcc -Imuon.p -I. -I../muon-v0.4.0 -I../muon-v0.4.0/include -Isubprojects/tinyjson -I../muon-v0.4.0/subprojects/tinyjson -Isubprojects/bestline -I../muon-v0.4.0/subprojects/bestline -Isrc/script -I/usr/include/pkgconf -fdiagnostics-color=always -D_FILE_OFFSET_BITS=64 -Wall -Winvalid-pch -Wextra -Wpedantic -Wendif-labels -Wimplicit-fallthrough=2 -Winit-self -Wlogical-op -Wmissing-include-dirs -Wno-missing-braces -Wno-missing-field-initializers -Wno-unused-parameter -Wold-style-definition -Woverflow -Wstrict-aliasing=2 -Wstrict-prototypes -Wundef -Wvla -fstrict-aliasing -std=c99 -DMUON_BOOTSTRAPPED -O2 -pipe -DMUON_PLATFORM_posix -DMUON_ENDIAN=0 -MD -MQ muon.p/src_functions_kernel_options.c.o -MF muon.p/src_functions_kernel_options.c.o.d -o muon.p/src_functions_kernel_options.c.o -c ../muon-v0.4.0/src/functions/kernel/options.c >[41/131] riscv64-unknown-linux-gnu-gcc -Imuon.p -I. -I../muon-v0.4.0 -I../muon-v0.4.0/include -Isubprojects/tinyjson -I../muon-v0.4.0/subprojects/tinyjson -Isubprojects/bestline -I../muon-v0.4.0/subprojects/bestline -Isrc/script -I/usr/include/pkgconf -fdiagnostics-color=always -D_FILE_OFFSET_BITS=64 -Wall -Winvalid-pch -Wextra -Wpedantic -Wendif-labels -Wimplicit-fallthrough=2 -Winit-self -Wlogical-op -Wmissing-include-dirs -Wno-missing-braces -Wno-missing-field-initializers -Wno-unused-parameter -Wold-style-definition -Woverflow -Wstrict-aliasing=2 -Wstrict-prototypes -Wundef -Wvla -fstrict-aliasing -std=c99 -DMUON_BOOTSTRAPPED -O2 -pipe -DMUON_PLATFORM_posix -DMUON_ENDIAN=0 -MD -MQ muon.p/src_functions_generator.c.o -MF muon.p/src_functions_generator.c.o.d -o muon.p/src_functions_generator.c.o -c ../muon-v0.4.0/src/functions/generator.c >[42/131] riscv64-unknown-linux-gnu-gcc -Imuon.p -I. -I../muon-v0.4.0 -I../muon-v0.4.0/include -Isubprojects/tinyjson -I../muon-v0.4.0/subprojects/tinyjson -Isubprojects/bestline -I../muon-v0.4.0/subprojects/bestline -Isrc/script -I/usr/include/pkgconf -fdiagnostics-color=always -D_FILE_OFFSET_BITS=64 -Wall -Winvalid-pch -Wextra -Wpedantic -Wendif-labels -Wimplicit-fallthrough=2 -Winit-self -Wlogical-op -Wmissing-include-dirs -Wno-missing-braces -Wno-missing-field-initializers -Wno-unused-parameter -Wold-style-definition -Woverflow -Wstrict-aliasing=2 -Wstrict-prototypes -Wundef -Wvla -fstrict-aliasing -std=c99 -DMUON_BOOTSTRAPPED -O2 -pipe -DMUON_PLATFORM_posix -DMUON_ENDIAN=0 -MD -MQ muon.p/src_functions_number.c.o -MF muon.p/src_functions_number.c.o.d -o muon.p/src_functions_number.c.o -c ../muon-v0.4.0/src/functions/number.c >[43/131] riscv64-unknown-linux-gnu-gcc -Imuon.p -I. -I../muon-v0.4.0 -I../muon-v0.4.0/include -Isubprojects/tinyjson -I../muon-v0.4.0/subprojects/tinyjson -Isubprojects/bestline -I../muon-v0.4.0/subprojects/bestline -Isrc/script -I/usr/include/pkgconf -fdiagnostics-color=always -D_FILE_OFFSET_BITS=64 -Wall -Winvalid-pch -Wextra -Wpedantic -Wendif-labels -Wimplicit-fallthrough=2 -Winit-self -Wlogical-op -Wmissing-include-dirs -Wno-missing-braces -Wno-missing-field-initializers -Wno-unused-parameter -Wold-style-definition -Woverflow -Wstrict-aliasing=2 -Wstrict-prototypes -Wundef -Wvla -fstrict-aliasing -std=c99 -DMUON_BOOTSTRAPPED -O2 -pipe -DMUON_PLATFORM_posix -DMUON_ENDIAN=0 -MD -MQ muon.p/src_functions_source_configuration.c.o -MF muon.p/src_functions_source_configuration.c.o.d -o muon.p/src_functions_source_configuration.c.o -c ../muon-v0.4.0/src/functions/source_configuration.c >[44/131] riscv64-unknown-linux-gnu-gcc -Imuon.p -I. -I../muon-v0.4.0 -I../muon-v0.4.0/include -Isubprojects/tinyjson -I../muon-v0.4.0/subprojects/tinyjson -Isubprojects/bestline -I../muon-v0.4.0/subprojects/bestline -Isrc/script -I/usr/include/pkgconf -fdiagnostics-color=always -D_FILE_OFFSET_BITS=64 -Wall -Winvalid-pch -Wextra -Wpedantic -Wendif-labels -Wimplicit-fallthrough=2 -Winit-self -Wlogical-op -Wmissing-include-dirs -Wno-missing-braces -Wno-missing-field-initializers -Wno-unused-parameter -Wold-style-definition -Woverflow -Wstrict-aliasing=2 -Wstrict-prototypes -Wundef -Wvla -fstrict-aliasing -std=c99 -DMUON_BOOTSTRAPPED -O2 -pipe -DMUON_PLATFORM_posix -DMUON_ENDIAN=0 -MD -MQ muon.p/src_functions_modules_toolchain.c.o -MF muon.p/src_functions_modules_toolchain.c.o.d -o muon.p/src_functions_modules_toolchain.c.o -c ../muon-v0.4.0/src/functions/modules/toolchain.c >[45/131] riscv64-unknown-linux-gnu-gcc -Imuon.p -I. -I../muon-v0.4.0 -I../muon-v0.4.0/include -Isubprojects/tinyjson -I../muon-v0.4.0/subprojects/tinyjson -Isubprojects/bestline -I../muon-v0.4.0/subprojects/bestline -Isrc/script -I/usr/include/pkgconf -fdiagnostics-color=always -D_FILE_OFFSET_BITS=64 -Wall -Winvalid-pch -Wextra -Wpedantic -Wendif-labels -Wimplicit-fallthrough=2 -Winit-self -Wlogical-op -Wmissing-include-dirs -Wno-missing-braces -Wno-missing-field-initializers -Wno-unused-parameter -Wold-style-definition -Woverflow -Wstrict-aliasing=2 -Wstrict-prototypes -Wundef -Wvla -fstrict-aliasing -std=c99 -DMUON_BOOTSTRAPPED -O2 -pipe -DMUON_PLATFORM_posix -DMUON_ENDIAN=0 -MD -MQ muon.p/src_functions_run_result.c.o -MF muon.p/src_functions_run_result.c.o.d -o muon.p/src_functions_run_result.c.o -c ../muon-v0.4.0/src/functions/run_result.c >[46/131] riscv64-unknown-linux-gnu-gcc -Imuon.p -I. -I../muon-v0.4.0 -I../muon-v0.4.0/include -Isubprojects/tinyjson -I../muon-v0.4.0/subprojects/tinyjson -Isubprojects/bestline -I../muon-v0.4.0/subprojects/bestline -Isrc/script -I/usr/include/pkgconf -fdiagnostics-color=always -D_FILE_OFFSET_BITS=64 -Wall -Winvalid-pch -Wextra -Wpedantic -Wendif-labels -Wimplicit-fallthrough=2 -Winit-self -Wlogical-op -Wmissing-include-dirs -Wno-missing-braces -Wno-missing-field-initializers -Wno-unused-parameter -Wold-style-definition -Woverflow -Wstrict-aliasing=2 -Wstrict-prototypes -Wundef -Wvla -fstrict-aliasing -std=c99 -DMUON_BOOTSTRAPPED -O2 -pipe -DMUON_PLATFORM_posix -DMUON_ENDIAN=0 -MD -MQ muon.p/src_functions_kernel_subproject.c.o -MF muon.p/src_functions_kernel_subproject.c.o.d -o muon.p/src_functions_kernel_subproject.c.o -c ../muon-v0.4.0/src/functions/kernel/subproject.c >[47/131] riscv64-unknown-linux-gnu-gcc -Imuon.p -I. -I../muon-v0.4.0 -I../muon-v0.4.0/include -Isubprojects/tinyjson -I../muon-v0.4.0/subprojects/tinyjson -Isubprojects/bestline -I../muon-v0.4.0/subprojects/bestline -Isrc/script -I/usr/include/pkgconf -fdiagnostics-color=always -D_FILE_OFFSET_BITS=64 -Wall -Winvalid-pch -Wextra -Wpedantic -Wendif-labels -Wimplicit-fallthrough=2 -Winit-self -Wlogical-op -Wmissing-include-dirs -Wno-missing-braces -Wno-missing-field-initializers -Wno-unused-parameter -Wold-style-definition -Woverflow -Wstrict-aliasing=2 -Wstrict-prototypes -Wundef -Wvla -fstrict-aliasing -std=c99 -DMUON_BOOTSTRAPPED -O2 -pipe -DMUON_PLATFORM_posix -DMUON_ENDIAN=0 -MD -MQ muon.p/src_backend_ninja_rules.c.o -MF muon.p/src_backend_ninja_rules.c.o.d -o muon.p/src_backend_ninja_rules.c.o -c ../muon-v0.4.0/src/backend/ninja/rules.c >[48/131] riscv64-unknown-linux-gnu-gcc -Imuon.p -I. -I../muon-v0.4.0 -I../muon-v0.4.0/include -Isubprojects/tinyjson -I../muon-v0.4.0/subprojects/tinyjson -Isubprojects/bestline -I../muon-v0.4.0/subprojects/bestline -Isrc/script -I/usr/include/pkgconf -fdiagnostics-color=always -D_FILE_OFFSET_BITS=64 -Wall -Winvalid-pch -Wextra -Wpedantic -Wendif-labels -Wimplicit-fallthrough=2 -Winit-self -Wlogical-op -Wmissing-include-dirs -Wno-missing-braces -Wno-missing-field-initializers -Wno-unused-parameter -Wold-style-definition -Woverflow -Wstrict-aliasing=2 -Wstrict-prototypes -Wundef -Wvla -fstrict-aliasing -std=c99 -DMUON_BOOTSTRAPPED -O2 -pipe -DMUON_PLATFORM_posix -DMUON_ENDIAN=0 -MD -MQ muon.p/src_functions_kernel_install.c.o -MF muon.p/src_functions_kernel_install.c.o.d -o muon.p/src_functions_kernel_install.c.o -c ../muon-v0.4.0/src/functions/kernel/install.c >[49/131] riscv64-unknown-linux-gnu-gcc -Imuon.p -I. -I../muon-v0.4.0 -I../muon-v0.4.0/include -Isubprojects/tinyjson -I../muon-v0.4.0/subprojects/tinyjson -Isubprojects/bestline -I../muon-v0.4.0/subprojects/bestline -Isrc/script -I/usr/include/pkgconf -fdiagnostics-color=always -D_FILE_OFFSET_BITS=64 -Wall -Winvalid-pch -Wextra -Wpedantic -Wendif-labels -Wimplicit-fallthrough=2 -Winit-self -Wlogical-op -Wmissing-include-dirs -Wno-missing-braces -Wno-missing-field-initializers -Wno-unused-parameter -Wold-style-definition -Woverflow -Wstrict-aliasing=2 -Wstrict-prototypes -Wundef -Wvla -fstrict-aliasing -std=c99 -DMUON_BOOTSTRAPPED -O2 -pipe -DMUON_PLATFORM_posix -DMUON_ENDIAN=0 -MD -MQ muon.p/src_functions_modules.c.o -MF muon.p/src_functions_modules.c.o.d -o muon.p/src_functions_modules.c.o -c ../muon-v0.4.0/src/functions/modules.c >[50/131] riscv64-unknown-linux-gnu-gcc -Imuon.p -I. -I../muon-v0.4.0 -I../muon-v0.4.0/include -Isubprojects/tinyjson -I../muon-v0.4.0/subprojects/tinyjson -Isubprojects/bestline -I../muon-v0.4.0/subprojects/bestline -Isrc/script -I/usr/include/pkgconf -fdiagnostics-color=always -D_FILE_OFFSET_BITS=64 -Wall -Winvalid-pch -Wextra -Wpedantic -Wendif-labels -Wimplicit-fallthrough=2 -Winit-self -Wlogical-op -Wmissing-include-dirs -Wno-missing-braces -Wno-missing-field-initializers -Wno-unused-parameter -Wold-style-definition -Woverflow -Wstrict-aliasing=2 -Wstrict-prototypes -Wundef -Wvla -fstrict-aliasing -std=c99 -DMUON_BOOTSTRAPPED -O2 -pipe -DMUON_PLATFORM_posix -DMUON_ENDIAN=0 -MD -MQ muon.p/src_functions_subproject.c.o -MF muon.p/src_functions_subproject.c.o.d -o muon.p/src_functions_subproject.c.o -c ../muon-v0.4.0/src/functions/subproject.c >[51/131] riscv64-unknown-linux-gnu-gcc -Imuon.p -I. -I../muon-v0.4.0 -I../muon-v0.4.0/include -Isubprojects/tinyjson -I../muon-v0.4.0/subprojects/tinyjson -Isubprojects/bestline -I../muon-v0.4.0/subprojects/bestline -Isrc/script -I/usr/include/pkgconf -fdiagnostics-color=always -D_FILE_OFFSET_BITS=64 -Wall -Winvalid-pch -Wextra -Wpedantic -Wendif-labels -Wimplicit-fallthrough=2 -Winit-self -Wlogical-op -Wmissing-include-dirs -Wno-missing-braces -Wno-missing-field-initializers -Wno-unused-parameter -Wold-style-definition -Woverflow -Wstrict-aliasing=2 -Wstrict-prototypes -Wundef -Wvla -fstrict-aliasing -std=c99 -DMUON_BOOTSTRAPPED -O2 -pipe -DMUON_PLATFORM_posix -DMUON_ENDIAN=0 -MD -MQ muon.p/src_backend_introspect.c.o -MF muon.p/src_backend_introspect.c.o.d -o muon.p/src_backend_introspect.c.o -c ../muon-v0.4.0/src/backend/introspect.c >[52/131] riscv64-unknown-linux-gnu-gcc -Imuon.p -I. -I../muon-v0.4.0 -I../muon-v0.4.0/include -Isubprojects/tinyjson -I../muon-v0.4.0/subprojects/tinyjson -Isubprojects/bestline -I../muon-v0.4.0/subprojects/bestline -Isrc/script -I/usr/include/pkgconf -fdiagnostics-color=always -D_FILE_OFFSET_BITS=64 -Wall -Winvalid-pch -Wextra -Wpedantic -Wendif-labels -Wimplicit-fallthrough=2 -Winit-self -Wlogical-op -Wmissing-include-dirs -Wno-missing-braces -Wno-missing-field-initializers -Wno-unused-parameter -Wold-style-definition -Woverflow -Wstrict-aliasing=2 -Wstrict-prototypes -Wundef -Wvla -fstrict-aliasing -std=c99 -DMUON_BOOTSTRAPPED -O2 -pipe -DMUON_PLATFORM_posix -DMUON_ENDIAN=0 -MD -MQ muon.p/src_functions_modules_subprojects.c.o -MF muon.p/src_functions_modules_subprojects.c.o.d -o muon.p/src_functions_modules_subprojects.c.o -c ../muon-v0.4.0/src/functions/modules/subprojects.c >[53/131] riscv64-unknown-linux-gnu-gcc -Imuon.p -I. -I../muon-v0.4.0 -I../muon-v0.4.0/include -Isubprojects/tinyjson -I../muon-v0.4.0/subprojects/tinyjson -Isubprojects/bestline -I../muon-v0.4.0/subprojects/bestline -Isrc/script -I/usr/include/pkgconf -fdiagnostics-color=always -D_FILE_OFFSET_BITS=64 -Wall -Winvalid-pch -Wextra -Wpedantic -Wendif-labels -Wimplicit-fallthrough=2 -Winit-self -Wlogical-op -Wmissing-include-dirs -Wno-missing-braces -Wno-missing-field-initializers -Wno-unused-parameter -Wold-style-definition -Woverflow -Wstrict-aliasing=2 -Wstrict-prototypes -Wundef -Wvla -fstrict-aliasing -std=c99 -DMUON_BOOTSTRAPPED -O2 -pipe -DMUON_PLATFORM_posix -DMUON_ENDIAN=0 -MD -MQ muon.p/src_lang_object_iterators.c.o -MF muon.p/src_lang_object_iterators.c.o.d -o muon.p/src_lang_object_iterators.c.o -c ../muon-v0.4.0/src/lang/object_iterators.c >[54/131] riscv64-unknown-linux-gnu-gcc -Imuon.p -I. -I../muon-v0.4.0 -I../muon-v0.4.0/include -Isubprojects/tinyjson -I../muon-v0.4.0/subprojects/tinyjson -Isubprojects/bestline -I../muon-v0.4.0/subprojects/bestline -Isrc/script -I/usr/include/pkgconf -fdiagnostics-color=always -D_FILE_OFFSET_BITS=64 -Wall -Winvalid-pch -Wextra -Wpedantic -Wendif-labels -Wimplicit-fallthrough=2 -Winit-self -Wlogical-op -Wmissing-include-dirs -Wno-missing-braces -Wno-missing-field-initializers -Wno-unused-parameter -Wold-style-definition -Woverflow -Wstrict-aliasing=2 -Wstrict-prototypes -Wundef -Wvla -fstrict-aliasing -std=c99 -DMUON_BOOTSTRAPPED -O2 -pipe -DMUON_PLATFORM_posix -DMUON_ENDIAN=0 -MD -MQ muon.p/src_functions_modules_getopt.c.o -MF muon.p/src_functions_modules_getopt.c.o.d -o muon.p/src_functions_modules_getopt.c.o -c ../muon-v0.4.0/src/functions/modules/getopt.c >[55/131] riscv64-unknown-linux-gnu-gcc -Imuon.p -I. -I../muon-v0.4.0 -I../muon-v0.4.0/include -Isubprojects/tinyjson -I../muon-v0.4.0/subprojects/tinyjson -Isubprojects/bestline -I../muon-v0.4.0/subprojects/bestline -Isrc/script -I/usr/include/pkgconf -fdiagnostics-color=always -D_FILE_OFFSET_BITS=64 -Wall -Winvalid-pch -Wextra -Wpedantic -Wendif-labels -Wimplicit-fallthrough=2 -Winit-self -Wlogical-op -Wmissing-include-dirs -Wno-missing-braces -Wno-missing-field-initializers -Wno-unused-parameter -Wold-style-definition -Woverflow -Wstrict-aliasing=2 -Wstrict-prototypes -Wundef -Wvla -fstrict-aliasing -std=c99 -DMUON_BOOTSTRAPPED -O2 -pipe -DMUON_PLATFORM_posix -DMUON_ENDIAN=0 -MD -MQ muon.p/src_functions_source_set.c.o -MF muon.p/src_functions_source_set.c.o.d -o muon.p/src_functions_source_set.c.o -c ../muon-v0.4.0/src/functions/source_set.c >[56/131] riscv64-unknown-linux-gnu-gcc -Imuon.p -I. -I../muon-v0.4.0 -I../muon-v0.4.0/include -Isubprojects/tinyjson -I../muon-v0.4.0/subprojects/tinyjson -Isubprojects/bestline -I../muon-v0.4.0/subprojects/bestline -Isrc/script -I/usr/include/pkgconf -fdiagnostics-color=always -D_FILE_OFFSET_BITS=64 -Wall -Winvalid-pch -Wextra -Wpedantic -Wendif-labels -Wimplicit-fallthrough=2 -Winit-self -Wlogical-op -Wmissing-include-dirs -Wno-missing-braces -Wno-missing-field-initializers -Wno-unused-parameter -Wold-style-definition -Woverflow -Wstrict-aliasing=2 -Wstrict-prototypes -Wundef -Wvla -fstrict-aliasing -std=c99 -DMUON_BOOTSTRAPPED -O2 -pipe -DMUON_PLATFORM_posix -DMUON_ENDIAN=0 -MD -MQ muon.p/src_functions_modules_python.c.o -MF muon.p/src_functions_modules_python.c.o.d -o muon.p/src_functions_modules_python.c.o -c ../muon-v0.4.0/src/functions/modules/python.c >[57/131] riscv64-unknown-linux-gnu-gcc -Imuon.p -I. -I../muon-v0.4.0 -I../muon-v0.4.0/include -Isubprojects/tinyjson -I../muon-v0.4.0/subprojects/tinyjson -Isubprojects/bestline -I../muon-v0.4.0/subprojects/bestline -Isrc/script -I/usr/include/pkgconf -fdiagnostics-color=always -D_FILE_OFFSET_BITS=64 -Wall -Winvalid-pch -Wextra -Wpedantic -Wendif-labels -Wimplicit-fallthrough=2 -Winit-self -Wlogical-op -Wmissing-include-dirs -Wno-missing-braces -Wno-missing-field-initializers -Wno-unused-parameter -Wold-style-definition -Woverflow -Wstrict-aliasing=2 -Wstrict-prototypes -Wundef -Wvla -fstrict-aliasing -std=c99 -DMUON_BOOTSTRAPPED -O2 -pipe -DMUON_PLATFORM_posix -DMUON_ENDIAN=0 -MD -MQ muon.p/src_functions_kernel_custom_target.c.o -MF muon.p/src_functions_kernel_custom_target.c.o.d -o muon.p/src_functions_kernel_custom_target.c.o -c ../muon-v0.4.0/src/functions/kernel/custom_target.c >[58/131] riscv64-unknown-linux-gnu-gcc -Imuon.p -I. -I../muon-v0.4.0 -I../muon-v0.4.0/include -Isubprojects/tinyjson -I../muon-v0.4.0/subprojects/tinyjson -Isubprojects/bestline -I../muon-v0.4.0/subprojects/bestline -Isrc/script -I/usr/include/pkgconf -fdiagnostics-color=always -D_FILE_OFFSET_BITS=64 -Wall -Winvalid-pch -Wextra -Wpedantic -Wendif-labels -Wimplicit-fallthrough=2 -Winit-self -Wlogical-op -Wmissing-include-dirs -Wno-missing-braces -Wno-missing-field-initializers -Wno-unused-parameter -Wold-style-definition -Woverflow -Wstrict-aliasing=2 -Wstrict-prototypes -Wundef -Wvla -fstrict-aliasing -std=c99 -DMUON_BOOTSTRAPPED -O2 -pipe -DMUON_PLATFORM_posix -DMUON_ENDIAN=0 -MD -MQ muon.p/src_functions_meson.c.o -MF muon.p/src_functions_meson.c.o.d -o muon.p/src_functions_meson.c.o -c ../muon-v0.4.0/src/functions/meson.c >[59/131] riscv64-unknown-linux-gnu-gcc -Imuon.p -I. -I../muon-v0.4.0 -I../muon-v0.4.0/include -Isubprojects/tinyjson -I../muon-v0.4.0/subprojects/tinyjson -Isubprojects/bestline -I../muon-v0.4.0/subprojects/bestline -Isrc/script -I/usr/include/pkgconf -fdiagnostics-color=always -D_FILE_OFFSET_BITS=64 -Wall -Winvalid-pch -Wextra -Wpedantic -Wendif-labels -Wimplicit-fallthrough=2 -Winit-self -Wlogical-op -Wmissing-include-dirs -Wno-missing-braces -Wno-missing-field-initializers -Wno-unused-parameter -Wold-style-definition -Woverflow -Wstrict-aliasing=2 -Wstrict-prototypes -Wundef -Wvla -fstrict-aliasing -std=c99 -DMUON_BOOTSTRAPPED -O2 -pipe -DMUON_PLATFORM_posix -DMUON_ENDIAN=0 -MD -MQ muon.p/src_functions_string.c.o -MF muon.p/src_functions_string.c.o.d -o muon.p/src_functions_string.c.o -c ../muon-v0.4.0/src/functions/string.c >[60/131] riscv64-unknown-linux-gnu-gcc -Imuon.p -I. -I../muon-v0.4.0 -I../muon-v0.4.0/include -Isubprojects/tinyjson -I../muon-v0.4.0/subprojects/tinyjson -Isubprojects/bestline -I../muon-v0.4.0/subprojects/bestline -Isrc/script -I/usr/include/pkgconf -fdiagnostics-color=always -D_FILE_OFFSET_BITS=64 -Wall -Winvalid-pch -Wextra -Wpedantic -Wendif-labels -Wimplicit-fallthrough=2 -Winit-self -Wlogical-op -Wmissing-include-dirs -Wno-missing-braces -Wno-missing-field-initializers -Wno-unused-parameter -Wold-style-definition -Woverflow -Wstrict-aliasing=2 -Wstrict-prototypes -Wundef -Wvla -fstrict-aliasing -std=c99 -DMUON_BOOTSTRAPPED -O2 -pipe -DMUON_PLATFORM_posix -DMUON_ENDIAN=0 -MD -MQ muon.p/src_lang_serial.c.o -MF muon.p/src_lang_serial.c.o.d -o muon.p/src_lang_serial.c.o -c ../muon-v0.4.0/src/lang/serial.c >[61/131] riscv64-unknown-linux-gnu-gcc -Imuon.p -I. -I../muon-v0.4.0 -I../muon-v0.4.0/include -Isubprojects/tinyjson -I../muon-v0.4.0/subprojects/tinyjson -Isubprojects/bestline -I../muon-v0.4.0/subprojects/bestline -Isrc/script -I/usr/include/pkgconf -fdiagnostics-color=always -D_FILE_OFFSET_BITS=64 -Wall -Winvalid-pch -Wextra -Wpedantic -Wendif-labels -Wimplicit-fallthrough=2 -Winit-self -Wlogical-op -Wmissing-include-dirs -Wno-missing-braces -Wno-missing-field-initializers -Wno-unused-parameter -Wold-style-definition -Woverflow -Wstrict-aliasing=2 -Wstrict-prototypes -Wundef -Wvla -fstrict-aliasing -std=c99 -DMUON_BOOTSTRAPPED -O2 -pipe -DMUON_PLATFORM_posix -DMUON_ENDIAN=0 -MD -MQ muon.p/src_lang_eval.c.o -MF muon.p/src_lang_eval.c.o.d -o muon.p/src_lang_eval.c.o -c ../muon-v0.4.0/src/lang/eval.c >[62/131] riscv64-unknown-linux-gnu-gcc -Imuon.p -I. -I../muon-v0.4.0 -I../muon-v0.4.0/include -Isubprojects/tinyjson -I../muon-v0.4.0/subprojects/tinyjson -Isubprojects/bestline -I../muon-v0.4.0/subprojects/bestline -Isrc/script -I/usr/include/pkgconf -fdiagnostics-color=always -D_FILE_OFFSET_BITS=64 -Wall -Winvalid-pch -Wextra -Wpedantic -Wendif-labels -Wimplicit-fallthrough=2 -Winit-self -Wlogical-op -Wmissing-include-dirs -Wno-missing-braces -Wno-missing-field-initializers -Wno-unused-parameter -Wold-style-definition -Woverflow -Wstrict-aliasing=2 -Wstrict-prototypes -Wundef -Wvla -fstrict-aliasing -std=c99 -DMUON_BOOTSTRAPPED -O2 -pipe -DMUON_PLATFORM_posix -DMUON_ENDIAN=0 -MD -MQ muon.p/src_args.c.o -MF muon.p/src_args.c.o.d -o muon.p/src_args.c.o -c ../muon-v0.4.0/src/args.c >[63/131] riscv64-unknown-linux-gnu-gcc -Imuon.p -I. -I../muon-v0.4.0 -I../muon-v0.4.0/include -Isubprojects/tinyjson -I../muon-v0.4.0/subprojects/tinyjson -Isubprojects/bestline -I../muon-v0.4.0/subprojects/bestline -Isrc/script -I/usr/include/pkgconf -fdiagnostics-color=always -D_FILE_OFFSET_BITS=64 -Wall -Winvalid-pch -Wextra -Wpedantic -Wendif-labels -Wimplicit-fallthrough=2 -Winit-self -Wlogical-op -Wmissing-include-dirs -Wno-missing-braces -Wno-missing-field-initializers -Wno-unused-parameter -Wold-style-definition -Woverflow -Wstrict-aliasing=2 -Wstrict-prototypes -Wundef -Wvla -fstrict-aliasing -std=c99 -DMUON_BOOTSTRAPPED -O2 -pipe -DMUON_PLATFORM_posix -DMUON_ENDIAN=0 -MD -MQ muon.p/src_cmd_subprojects.c.o -MF muon.p/src_cmd_subprojects.c.o.d -o muon.p/src_cmd_subprojects.c.o -c ../muon-v0.4.0/src/cmd_subprojects.c >[64/131] riscv64-unknown-linux-gnu-gcc -Imuon.p -I. -I../muon-v0.4.0 -I../muon-v0.4.0/include -Isubprojects/tinyjson -I../muon-v0.4.0/subprojects/tinyjson -Isubprojects/bestline -I../muon-v0.4.0/subprojects/bestline -Isrc/script -I/usr/include/pkgconf -fdiagnostics-color=always -D_FILE_OFFSET_BITS=64 -Wall -Winvalid-pch -Wextra -Wpedantic -Wendif-labels -Wimplicit-fallthrough=2 -Winit-self -Wlogical-op -Wmissing-include-dirs -Wno-missing-braces -Wno-missing-field-initializers -Wno-unused-parameter -Wold-style-definition -Woverflow -Wstrict-aliasing=2 -Wstrict-prototypes -Wundef -Wvla -fstrict-aliasing -std=c99 -DMUON_BOOTSTRAPPED -O2 -pipe -DMUON_PLATFORM_posix -DMUON_ENDIAN=0 -MD -MQ muon.p/src_cmd_install.c.o -MF muon.p/src_cmd_install.c.o.d -o muon.p/src_cmd_install.c.o -c ../muon-v0.4.0/src/cmd_install.c >[65/131] riscv64-unknown-linux-gnu-gcc -Imuon.p -I. -I../muon-v0.4.0 -I../muon-v0.4.0/include -Isubprojects/tinyjson -I../muon-v0.4.0/subprojects/tinyjson -Isubprojects/bestline -I../muon-v0.4.0/subprojects/bestline -Isrc/script -I/usr/include/pkgconf -fdiagnostics-color=always -D_FILE_OFFSET_BITS=64 -Wall -Winvalid-pch -Wextra -Wpedantic -Wendif-labels -Wimplicit-fallthrough=2 -Winit-self -Wlogical-op -Wmissing-include-dirs -Wno-missing-braces -Wno-missing-field-initializers -Wno-unused-parameter -Wold-style-definition -Woverflow -Wstrict-aliasing=2 -Wstrict-prototypes -Wundef -Wvla -fstrict-aliasing -std=c99 -DMUON_BOOTSTRAPPED -O2 -pipe -DMUON_PLATFORM_posix -DMUON_ENDIAN=0 -MD -MQ muon.p/src_lang_workspace.c.o -MF muon.p/src_lang_workspace.c.o.d -o muon.p/src_lang_workspace.c.o -c ../muon-v0.4.0/src/lang/workspace.c >[66/131] riscv64-unknown-linux-gnu-gcc -Imuon.p -I. -I../muon-v0.4.0 -I../muon-v0.4.0/include -Isubprojects/tinyjson -I../muon-v0.4.0/subprojects/tinyjson -Isubprojects/bestline -I../muon-v0.4.0/subprojects/bestline -Isrc/script -I/usr/include/pkgconf -fdiagnostics-color=always -D_FILE_OFFSET_BITS=64 -Wall -Winvalid-pch -Wextra -Wpedantic -Wendif-labels -Wimplicit-fallthrough=2 -Winit-self -Wlogical-op -Wmissing-include-dirs -Wno-missing-braces -Wno-missing-field-initializers -Wno-unused-parameter -Wold-style-definition -Woverflow -Wstrict-aliasing=2 -Wstrict-prototypes -Wundef -Wvla -fstrict-aliasing -std=c99 -DMUON_BOOTSTRAPPED -O2 -pipe -DMUON_PLATFORM_posix -DMUON_ENDIAN=0 -MD -MQ muon.p/src_backend_common_args.c.o -MF muon.p/src_backend_common_args.c.o.d -o muon.p/src_backend_common_args.c.o -c ../muon-v0.4.0/src/backend/common_args.c >[67/131] riscv64-unknown-linux-gnu-gcc -Imuon.p -I. -I../muon-v0.4.0 -I../muon-v0.4.0/include -Isubprojects/tinyjson -I../muon-v0.4.0/subprojects/tinyjson -Isubprojects/bestline -I../muon-v0.4.0/subprojects/bestline -Isrc/script -I/usr/include/pkgconf -fdiagnostics-color=always -D_FILE_OFFSET_BITS=64 -Wall -Winvalid-pch -Wextra -Wpedantic -Wendif-labels -Wimplicit-fallthrough=2 -Winit-self -Wlogical-op -Wmissing-include-dirs -Wno-missing-braces -Wno-missing-field-initializers -Wno-unused-parameter -Wold-style-definition -Woverflow -Wstrict-aliasing=2 -Wstrict-prototypes -Wundef -Wvla -fstrict-aliasing -std=c99 -DMUON_BOOTSTRAPPED -O2 -pipe -DMUON_PLATFORM_posix -DMUON_ENDIAN=0 -MD -MQ muon.p/src_backend_xcode.c.o -MF muon.p/src_backend_xcode.c.o.d -o muon.p/src_backend_xcode.c.o -c ../muon-v0.4.0/src/backend/xcode.c >[68/131] riscv64-unknown-linux-gnu-gcc -Imuon.p -I. -I../muon-v0.4.0 -I../muon-v0.4.0/include -Isubprojects/tinyjson -I../muon-v0.4.0/subprojects/tinyjson -Isubprojects/bestline -I../muon-v0.4.0/subprojects/bestline -Isrc/script -I/usr/include/pkgconf -fdiagnostics-color=always -D_FILE_OFFSET_BITS=64 -Wall -Winvalid-pch -Wextra -Wpedantic -Wendif-labels -Wimplicit-fallthrough=2 -Winit-self -Wlogical-op -Wmissing-include-dirs -Wno-missing-braces -Wno-missing-field-initializers -Wno-unused-parameter -Wold-style-definition -Woverflow -Wstrict-aliasing=2 -Wstrict-prototypes -Wundef -Wvla -fstrict-aliasing -std=c99 -DMUON_BOOTSTRAPPED -O2 -pipe -DMUON_PLATFORM_posix -DMUON_ENDIAN=0 -MD -MQ muon.p/src_guess.c.o -MF muon.p/src_guess.c.o.d -o muon.p/src_guess.c.o -c ../muon-v0.4.0/src/guess.c >[69/131] riscv64-unknown-linux-gnu-gcc -Imuon.p -I. -I../muon-v0.4.0 -I../muon-v0.4.0/include -Isubprojects/tinyjson -I../muon-v0.4.0/subprojects/tinyjson -Isubprojects/bestline -I../muon-v0.4.0/subprojects/bestline -Isrc/script -I/usr/include/pkgconf -fdiagnostics-color=always -D_FILE_OFFSET_BITS=64 -Wall -Winvalid-pch -Wextra -Wpedantic -Wendif-labels -Wimplicit-fallthrough=2 -Winit-self -Wlogical-op -Wmissing-include-dirs -Wno-missing-braces -Wno-missing-field-initializers -Wno-unused-parameter -Wold-style-definition -Woverflow -Wstrict-aliasing=2 -Wstrict-prototypes -Wundef -Wvla -fstrict-aliasing -std=c99 -DMUON_BOOTSTRAPPED -O2 -pipe -DMUON_PLATFORM_posix -DMUON_ENDIAN=0 -MD -MQ muon.p/src_lang_typecheck.c.o -MF muon.p/src_lang_typecheck.c.o.d -o muon.p/src_lang_typecheck.c.o -c ../muon-v0.4.0/src/lang/typecheck.c >[70/131] riscv64-unknown-linux-gnu-gcc -Imuon.p -I. -I../muon-v0.4.0 -I../muon-v0.4.0/include -Isubprojects/tinyjson -I../muon-v0.4.0/subprojects/tinyjson -Isubprojects/bestline -I../muon-v0.4.0/subprojects/bestline -Isrc/script -I/usr/include/pkgconf -fdiagnostics-color=always -D_FILE_OFFSET_BITS=64 -Wall -Winvalid-pch -Wextra -Wpedantic -Wendif-labels -Wimplicit-fallthrough=2 -Winit-self -Wlogical-op -Wmissing-include-dirs -Wno-missing-braces -Wno-missing-field-initializers -Wno-unused-parameter -Wold-style-definition -Woverflow -Wstrict-aliasing=2 -Wstrict-prototypes -Wundef -Wvla -fstrict-aliasing -std=c99 -DMUON_BOOTSTRAPPED -O2 -pipe -DMUON_PLATFORM_posix -DMUON_ENDIAN=0 -MD -MQ muon.p/src_functions_kernel_configure_file.c.o -MF muon.p/src_functions_kernel_configure_file.c.o.d -o muon.p/src_functions_kernel_configure_file.c.o -c ../muon-v0.4.0/src/functions/kernel/configure_file.c >[71/131] riscv64-unknown-linux-gnu-gcc -Imuon.p -I. -I../muon-v0.4.0 -I../muon-v0.4.0/include -Isubprojects/tinyjson -I../muon-v0.4.0/subprojects/tinyjson -Isubprojects/bestline -I../muon-v0.4.0/subprojects/bestline -Isrc/script -I/usr/include/pkgconf -fdiagnostics-color=always -D_FILE_OFFSET_BITS=64 -Wall -Winvalid-pch -Wextra -Wpedantic -Wendif-labels -Wimplicit-fallthrough=2 -Winit-self -Wlogical-op -Wmissing-include-dirs -Wno-missing-braces -Wno-missing-field-initializers -Wno-unused-parameter -Wold-style-definition -Woverflow -Wstrict-aliasing=2 -Wstrict-prototypes -Wundef -Wvla -fstrict-aliasing -std=c99 -DMUON_BOOTSTRAPPED -O2 -pipe -DMUON_PLATFORM_posix -DMUON_ENDIAN=0 -MD -MQ muon.p/src_functions_modules_pkgconfig.c.o -MF muon.p/src_functions_modules_pkgconfig.c.o.d -o muon.p/src_functions_modules_pkgconfig.c.o -c ../muon-v0.4.0/src/functions/modules/pkgconfig.c >[72/131] riscv64-unknown-linux-gnu-gcc -Imuon.p -I. -I../muon-v0.4.0 -I../muon-v0.4.0/include -Isubprojects/tinyjson -I../muon-v0.4.0/subprojects/tinyjson -Isubprojects/bestline -I../muon-v0.4.0/subprojects/bestline -Isrc/script -I/usr/include/pkgconf -fdiagnostics-color=always -D_FILE_OFFSET_BITS=64 -Wall -Winvalid-pch -Wextra -Wpedantic -Wendif-labels -Wimplicit-fallthrough=2 -Winit-self -Wlogical-op -Wmissing-include-dirs -Wno-missing-braces -Wno-missing-field-initializers -Wno-unused-parameter -Wold-style-definition -Woverflow -Wstrict-aliasing=2 -Wstrict-prototypes -Wundef -Wvla -fstrict-aliasing -std=c99 -DMUON_BOOTSTRAPPED -O2 -pipe -DMUON_PLATFORM_posix -DMUON_ENDIAN=0 -MD -MQ muon.p/src_functions_modules_fs.c.o -MF muon.p/src_functions_modules_fs.c.o.d -o muon.p/src_functions_modules_fs.c.o -c ../muon-v0.4.0/src/functions/modules/fs.c >[73/131] riscv64-unknown-linux-gnu-gcc -Imuon.p -I. -I../muon-v0.4.0 -I../muon-v0.4.0/include -Isubprojects/tinyjson -I../muon-v0.4.0/subprojects/tinyjson -Isubprojects/bestline -I../muon-v0.4.0/subprojects/bestline -Isrc/script -I/usr/include/pkgconf -fdiagnostics-color=always -D_FILE_OFFSET_BITS=64 -Wall -Winvalid-pch -Wextra -Wpedantic -Wendif-labels -Wimplicit-fallthrough=2 -Winit-self -Wlogical-op -Wmissing-include-dirs -Wno-missing-braces -Wno-missing-field-initializers -Wno-unused-parameter -Wold-style-definition -Woverflow -Wstrict-aliasing=2 -Wstrict-prototypes -Wundef -Wvla -fstrict-aliasing -std=c99 -DMUON_BOOTSTRAPPED -O2 -pipe -DMUON_PLATFORM_posix -DMUON_ENDIAN=0 -MD -MQ muon.p/src_machine_file.c.o -MF muon.p/src_machine_file.c.o.d -o muon.p/src_machine_file.c.o -c ../muon-v0.4.0/src/machine_file.c >[74/131] riscv64-unknown-linux-gnu-gcc -Imuon.p -I. -I../muon-v0.4.0 -I../muon-v0.4.0/include -Isubprojects/tinyjson -I../muon-v0.4.0/subprojects/tinyjson -Isubprojects/bestline -I../muon-v0.4.0/subprojects/bestline -Isrc/script -I/usr/include/pkgconf -fdiagnostics-color=always -D_FILE_OFFSET_BITS=64 -Wall -Winvalid-pch -Wextra -Wpedantic -Wendif-labels -Wimplicit-fallthrough=2 -Winit-self -Wlogical-op -Wmissing-include-dirs -Wno-missing-braces -Wno-missing-field-initializers -Wno-unused-parameter -Wold-style-definition -Woverflow -Wstrict-aliasing=2 -Wstrict-prototypes -Wundef -Wvla -fstrict-aliasing -std=c99 -DMUON_BOOTSTRAPPED -O2 -pipe -DMUON_PLATFORM_posix -DMUON_ENDIAN=0 -MD -MQ muon.p/src_opts.c.o -MF muon.p/src_opts.c.o.d -o muon.p/src_opts.c.o -c ../muon-v0.4.0/src/opts.c >[75/131] riscv64-unknown-linux-gnu-gcc -Imuon.p -I. -I../muon-v0.4.0 -I../muon-v0.4.0/include -Isubprojects/tinyjson -I../muon-v0.4.0/subprojects/tinyjson -Isubprojects/bestline -I../muon-v0.4.0/subprojects/bestline -Isrc/script -I/usr/include/pkgconf -fdiagnostics-color=always -D_FILE_OFFSET_BITS=64 -Wall -Winvalid-pch -Wextra -Wpedantic -Wendif-labels -Wimplicit-fallthrough=2 -Winit-self -Wlogical-op -Wmissing-include-dirs -Wno-missing-braces -Wno-missing-field-initializers -Wno-unused-parameter -Wold-style-definition -Woverflow -Wstrict-aliasing=2 -Wstrict-prototypes -Wundef -Wvla -fstrict-aliasing -std=c99 -DMUON_BOOTSTRAPPED -O2 -pipe -DMUON_PLATFORM_posix -DMUON_ENDIAN=0 -MD -MQ muon.p/src_platform_assert.c.o -MF muon.p/src_platform_assert.c.o.d -o muon.p/src_platform_assert.c.o -c ../muon-v0.4.0/src/platform/assert.c >[76/131] riscv64-unknown-linux-gnu-gcc -Imuon.p -I. -I../muon-v0.4.0 -I../muon-v0.4.0/include -Isubprojects/tinyjson -I../muon-v0.4.0/subprojects/tinyjson -Isubprojects/bestline -I../muon-v0.4.0/subprojects/bestline -Isrc/script -I/usr/include/pkgconf -fdiagnostics-color=always -D_FILE_OFFSET_BITS=64 -Wall -Winvalid-pch -Wextra -Wpedantic -Wendif-labels -Wimplicit-fallthrough=2 -Winit-self -Wlogical-op -Wmissing-include-dirs -Wno-missing-braces -Wno-missing-field-initializers -Wno-unused-parameter -Wold-style-definition -Woverflow -Wstrict-aliasing=2 -Wstrict-prototypes -Wundef -Wvla -fstrict-aliasing -std=c99 -DMUON_BOOTSTRAPPED -O2 -pipe -DMUON_PLATFORM_posix -DMUON_ENDIAN=0 -MD -MQ muon.p/src_coerce.c.o -MF muon.p/src_coerce.c.o.d -o muon.p/src_coerce.c.o -c ../muon-v0.4.0/src/coerce.c >[77/131] riscv64-unknown-linux-gnu-gcc -Imuon.p -I. -I../muon-v0.4.0 -I../muon-v0.4.0/include -Isubprojects/tinyjson -I../muon-v0.4.0/subprojects/tinyjson -Isubprojects/bestline -I../muon-v0.4.0/subprojects/bestline -Isrc/script -I/usr/include/pkgconf -fdiagnostics-color=always -D_FILE_OFFSET_BITS=64 -Wall -Winvalid-pch -Wextra -Wpedantic -Wendif-labels -Wimplicit-fallthrough=2 -Winit-self -Wlogical-op -Wmissing-include-dirs -Wno-missing-braces -Wno-missing-field-initializers -Wno-unused-parameter -Wold-style-definition -Woverflow -Wstrict-aliasing=2 -Wstrict-prototypes -Wundef -Wvla -fstrict-aliasing -std=c99 -DMUON_BOOTSTRAPPED -O2 -pipe -DMUON_PLATFORM_posix -DMUON_ENDIAN=0 -MD -MQ muon.p/src_log.c.o -MF muon.p/src_log.c.o.d -o muon.p/src_log.c.o -c ../muon-v0.4.0/src/log.c >[78/131] riscv64-unknown-linux-gnu-gcc -Imuon.p -I. -I../muon-v0.4.0 -I../muon-v0.4.0/include -Isubprojects/tinyjson -I../muon-v0.4.0/subprojects/tinyjson -Isubprojects/bestline -I../muon-v0.4.0/subprojects/bestline -Isrc/script -I/usr/include/pkgconf -fdiagnostics-color=always -D_FILE_OFFSET_BITS=64 -Wall -Winvalid-pch -Wextra -Wpedantic -Wendif-labels -Wimplicit-fallthrough=2 -Winit-self -Wlogical-op -Wmissing-include-dirs -Wno-missing-braces -Wno-missing-field-initializers -Wno-unused-parameter -Wold-style-definition -Woverflow -Wstrict-aliasing=2 -Wstrict-prototypes -Wundef -Wvla -fstrict-aliasing -std=c99 -DMUON_BOOTSTRAPPED -O2 -pipe -DMUON_PLATFORM_posix -DMUON_ENDIAN=0 -MD -MQ muon.p/src_install.c.o -MF muon.p/src_install.c.o.d -o muon.p/src_install.c.o -c ../muon-v0.4.0/src/install.c >[79/131] riscv64-unknown-linux-gnu-gcc -Imuon.p -I. -I../muon-v0.4.0 -I../muon-v0.4.0/include -Isubprojects/tinyjson -I../muon-v0.4.0/subprojects/tinyjson -Isubprojects/bestline -I../muon-v0.4.0/subprojects/bestline -Isrc/script -I/usr/include/pkgconf -fdiagnostics-color=always -D_FILE_OFFSET_BITS=64 -Wall -Winvalid-pch -Wextra -Wpedantic -Wendif-labels -Wimplicit-fallthrough=2 -Winit-self -Wlogical-op -Wmissing-include-dirs -Wno-missing-braces -Wno-missing-field-initializers -Wno-unused-parameter -Wold-style-definition -Woverflow -Wstrict-aliasing=2 -Wstrict-prototypes -Wundef -Wvla -fstrict-aliasing -std=c99 -DMUON_BOOTSTRAPPED -O2 -pipe -DMUON_PLATFORM_posix -DMUON_ENDIAN=0 -MD -MQ muon.p/src_memmem.c.o -MF muon.p/src_memmem.c.o.d -o muon.p/src_memmem.c.o -c ../muon-v0.4.0/src/memmem.c >[80/131] riscv64-unknown-linux-gnu-gcc -Imuon.p -I. -I../muon-v0.4.0 -I../muon-v0.4.0/include -Isubprojects/tinyjson -I../muon-v0.4.0/subprojects/tinyjson -Isubprojects/bestline -I../muon-v0.4.0/subprojects/bestline -Isrc/script -I/usr/include/pkgconf -fdiagnostics-color=always -D_FILE_OFFSET_BITS=64 -Wall -Winvalid-pch -Wextra -Wpedantic -Wendif-labels -Wimplicit-fallthrough=2 -Winit-self -Wlogical-op -Wmissing-include-dirs -Wno-missing-braces -Wno-missing-field-initializers -Wno-unused-parameter -Wold-style-definition -Woverflow -Wstrict-aliasing=2 -Wstrict-prototypes -Wundef -Wvla -fstrict-aliasing -std=c99 -DMUON_BOOTSTRAPPED -O2 -pipe -DMUON_PLATFORM_posix -DMUON_ENDIAN=0 -MD -MQ muon.p/src_sha_256.c.o -MF muon.p/src_sha_256.c.o.d -o muon.p/src_sha_256.c.o -c ../muon-v0.4.0/src/sha_256.c >[81/131] riscv64-unknown-linux-gnu-gcc -Imuon.p -I. -I../muon-v0.4.0 -I../muon-v0.4.0/include -Isubprojects/tinyjson -I../muon-v0.4.0/subprojects/tinyjson -Isubprojects/bestline -I../muon-v0.4.0/subprojects/bestline -Isrc/script -I/usr/include/pkgconf -fdiagnostics-color=always -D_FILE_OFFSET_BITS=64 -Wall -Winvalid-pch -Wextra -Wpedantic -Wendif-labels -Wimplicit-fallthrough=2 -Winit-self -Wlogical-op -Wmissing-include-dirs -Wno-missing-braces -Wno-missing-field-initializers -Wno-unused-parameter -Wold-style-definition -Woverflow -Wstrict-aliasing=2 -Wstrict-prototypes -Wundef -Wvla -fstrict-aliasing -std=c99 -DMUON_BOOTSTRAPPED -O2 -pipe -DMUON_PLATFORM_posix -DMUON_ENDIAN=0 -MD -MQ muon.p/src_rpmvercmp.c.o -MF muon.p/src_rpmvercmp.c.o.d -o muon.p/src_rpmvercmp.c.o -c ../muon-v0.4.0/src/rpmvercmp.c >[82/131] riscv64-unknown-linux-gnu-gcc -Imuon.p -I. -I../muon-v0.4.0 -I../muon-v0.4.0/include -Isubprojects/tinyjson -I../muon-v0.4.0/subprojects/tinyjson -Isubprojects/bestline -I../muon-v0.4.0/subprojects/bestline -Isrc/script -I/usr/include/pkgconf -fdiagnostics-color=always -D_FILE_OFFSET_BITS=64 -Wall -Winvalid-pch -Wextra -Wpedantic -Wendif-labels -Wimplicit-fallthrough=2 -Winit-self -Wlogical-op -Wmissing-include-dirs -Wno-missing-braces -Wno-missing-field-initializers -Wno-unused-parameter -Wold-style-definition -Woverflow -Wstrict-aliasing=2 -Wstrict-prototypes -Wundef -Wvla -fstrict-aliasing -std=c99 -DMUON_BOOTSTRAPPED -O2 -pipe -DMUON_PLATFORM_posix -DMUON_ENDIAN=0 -MD -MQ muon.p/src_embedded.c.o -MF muon.p/src_embedded.c.o.d -o muon.p/src_embedded.c.o -c ../muon-v0.4.0/src/embedded.c >[83/131] riscv64-unknown-linux-gnu-gcc -Imuon.p -I. -I../muon-v0.4.0 -I../muon-v0.4.0/include -Isubprojects/tinyjson -I../muon-v0.4.0/subprojects/tinyjson -Isubprojects/bestline -I../muon-v0.4.0/subprojects/bestline -Isrc/script -I/usr/include/pkgconf -fdiagnostics-color=always -D_FILE_OFFSET_BITS=64 -Wall -Winvalid-pch -Wextra -Wpedantic -Wendif-labels -Wimplicit-fallthrough=2 -Winit-self -Wlogical-op -Wmissing-include-dirs -Wno-missing-braces -Wno-missing-field-initializers -Wno-unused-parameter -Wold-style-definition -Woverflow -Wstrict-aliasing=2 -Wstrict-prototypes -Wundef -Wvla -fstrict-aliasing -std=c99 -DMUON_BOOTSTRAPPED -O2 -pipe -DMUON_PLATFORM_posix -DMUON_ENDIAN=0 -MD -MQ muon.p/src_machines.c.o -MF muon.p/src_machines.c.o.d -o muon.p/src_machines.c.o -c ../muon-v0.4.0/src/machines.c >[84/131] riscv64-unknown-linux-gnu-gcc -Imuon.p -I. -I../muon-v0.4.0 -I../muon-v0.4.0/include -Isubprojects/tinyjson -I../muon-v0.4.0/subprojects/tinyjson -Isubprojects/bestline -I../muon-v0.4.0/subprojects/bestline -Isrc/script -I/usr/include/pkgconf -fdiagnostics-color=always -D_FILE_OFFSET_BITS=64 -Wall -Winvalid-pch -Wextra -Wpedantic -Wendif-labels -Wimplicit-fallthrough=2 -Winit-self -Wlogical-op -Wmissing-include-dirs -Wno-missing-braces -Wno-missing-field-initializers -Wno-unused-parameter -Wold-style-definition -Woverflow -Wstrict-aliasing=2 -Wstrict-prototypes -Wundef -Wvla -fstrict-aliasing -std=c99 -DMUON_BOOTSTRAPPED -O2 -pipe -DMUON_PLATFORM_posix -DMUON_ENDIAN=0 -MD -MQ muon.p/src_lang_func_lookup.c.o -MF muon.p/src_lang_func_lookup.c.o.d -o muon.p/src_lang_func_lookup.c.o -c ../muon-v0.4.0/src/lang/func_lookup.c >[85/131] riscv64-unknown-linux-gnu-gcc -Imuon.p -I. -I../muon-v0.4.0 -I../muon-v0.4.0/include -Isubprojects/tinyjson -I../muon-v0.4.0/subprojects/tinyjson -Isubprojects/bestline -I../muon-v0.4.0/subprojects/bestline -Isrc/script -I/usr/include/pkgconf -fdiagnostics-color=always -D_FILE_OFFSET_BITS=64 -Wall -Winvalid-pch -Wextra -Wpedantic -Wendif-labels -Wimplicit-fallthrough=2 -Winit-self -Wlogical-op -Wmissing-include-dirs -Wno-missing-braces -Wno-missing-field-initializers -Wno-unused-parameter -Wold-style-definition -Woverflow -Wstrict-aliasing=2 -Wstrict-prototypes -Wundef -Wvla -fstrict-aliasing -std=c99 -DMUON_BOOTSTRAPPED -O2 -pipe -DMUON_PLATFORM_posix -DMUON_ENDIAN=0 -MD -MQ muon.p/src_platform_uname.c.o -MF muon.p/src_platform_uname.c.o.d -o muon.p/src_platform_uname.c.o -c ../muon-v0.4.0/src/platform/uname.c >[86/131] riscv64-unknown-linux-gnu-gcc -Imuon.p -I. -I../muon-v0.4.0 -I../muon-v0.4.0/include -Isubprojects/tinyjson -I../muon-v0.4.0/subprojects/tinyjson -Isubprojects/bestline -I../muon-v0.4.0/subprojects/bestline -Isrc/script -I/usr/include/pkgconf -fdiagnostics-color=always -D_FILE_OFFSET_BITS=64 -Wall -Winvalid-pch -Wextra -Wpedantic -Wendif-labels -Wimplicit-fallthrough=2 -Winit-self -Wlogical-op -Wmissing-include-dirs -Wno-missing-braces -Wno-missing-field-initializers -Wno-unused-parameter -Wold-style-definition -Woverflow -Wstrict-aliasing=2 -Wstrict-prototypes -Wundef -Wvla -fstrict-aliasing -std=c99 -DMUON_BOOTSTRAPPED -O2 -pipe -DMUON_PLATFORM_posix -DMUON_ENDIAN=0 -MD -MQ muon.p/src_vsenv.c.o -MF muon.p/src_vsenv.c.o.d -o muon.p/src_vsenv.c.o -c ../muon-v0.4.0/src/vsenv.c >[87/131] riscv64-unknown-linux-gnu-gcc -Imuon.p -I. -I../muon-v0.4.0 -I../muon-v0.4.0/include -Isubprojects/tinyjson -I../muon-v0.4.0/subprojects/tinyjson -Isubprojects/bestline -I../muon-v0.4.0/subprojects/bestline -Isrc/script -I/usr/include/pkgconf -fdiagnostics-color=always -D_FILE_OFFSET_BITS=64 -Wall -Winvalid-pch -Wextra -Wpedantic -Wendif-labels -Wimplicit-fallthrough=2 -Winit-self -Wlogical-op -Wmissing-include-dirs -Wno-missing-braces -Wno-missing-field-initializers -Wno-unused-parameter -Wold-style-definition -Woverflow -Wstrict-aliasing=2 -Wstrict-prototypes -Wundef -Wvla -fstrict-aliasing -std=c99 -DMUON_BOOTSTRAPPED -O2 -pipe -DMUON_PLATFORM_posix -DMUON_ENDIAN=0 -MD -MQ muon.p/src_platform_os.c.o -MF muon.p/src_platform_os.c.o.d -o muon.p/src_platform_os.c.o -c ../muon-v0.4.0/src/platform/os.c >[88/131] riscv64-unknown-linux-gnu-gcc -Imuon.p -I. -I../muon-v0.4.0 -I../muon-v0.4.0/include -Isubprojects/tinyjson -I../muon-v0.4.0/subprojects/tinyjson -Isubprojects/bestline -I../muon-v0.4.0/subprojects/bestline -Isrc/script -I/usr/include/pkgconf -fdiagnostics-color=always -D_FILE_OFFSET_BITS=64 -Wall -Winvalid-pch -Wextra -Wpedantic -Wendif-labels -Wimplicit-fallthrough=2 -Winit-self -Wlogical-op -Wmissing-include-dirs -Wno-missing-braces -Wno-missing-field-initializers -Wno-unused-parameter -Wold-style-definition -Woverflow -Wstrict-aliasing=2 -Wstrict-prototypes -Wundef -Wvla -fstrict-aliasing -std=c99 -DMUON_BOOTSTRAPPED -O2 -pipe -DMUON_PLATFORM_posix -DMUON_ENDIAN=0 -MD -MQ muon.p/src_platform_mem.c.o -MF muon.p/src_platform_mem.c.o.d -o muon.p/src_platform_mem.c.o -c ../muon-v0.4.0/src/platform/mem.c >[89/131] riscv64-unknown-linux-gnu-gcc -Imuon.p -I. -I../muon-v0.4.0 -I../muon-v0.4.0/include -Isubprojects/tinyjson -I../muon-v0.4.0/subprojects/tinyjson -Isubprojects/bestline -I../muon-v0.4.0/subprojects/bestline -Isrc/script -I/usr/include/pkgconf -fdiagnostics-color=always -D_FILE_OFFSET_BITS=64 -Wall -Winvalid-pch -Wextra -Wpedantic -Wendif-labels -Wimplicit-fallthrough=2 -Winit-self -Wlogical-op -Wmissing-include-dirs -Wno-missing-braces -Wno-missing-field-initializers -Wno-unused-parameter -Wold-style-definition -Woverflow -Wstrict-aliasing=2 -Wstrict-prototypes -Wundef -Wvla -fstrict-aliasing -std=c99 -DMUON_BOOTSTRAPPED -O2 -pipe -DMUON_PLATFORM_posix -DMUON_ENDIAN=0 -MD -MQ muon.p/src_error.c.o -MF muon.p/src_error.c.o.d -o muon.p/src_error.c.o -c ../muon-v0.4.0/src/error.c >[90/131] riscv64-unknown-linux-gnu-gcc -Imuon.p -I. -I../muon-v0.4.0 -I../muon-v0.4.0/include -Isubprojects/tinyjson -I../muon-v0.4.0/subprojects/tinyjson -Isubprojects/bestline -I../muon-v0.4.0/subprojects/bestline -Isrc/script -I/usr/include/pkgconf -fdiagnostics-color=always -D_FILE_OFFSET_BITS=64 -Wall -Winvalid-pch -Wextra -Wpedantic -Wendif-labels -Wimplicit-fallthrough=2 -Winit-self -Wlogical-op -Wmissing-include-dirs -Wno-missing-braces -Wno-missing-field-initializers -Wno-unused-parameter -Wold-style-definition -Woverflow -Wstrict-aliasing=2 -Wstrict-prototypes -Wundef -Wvla -fstrict-aliasing -std=c99 -DMUON_BOOTSTRAPPED -O2 -pipe -DMUON_PLATFORM_posix -DMUON_ENDIAN=0 -MD -MQ muon.p/src_platform_posix_log.c.o -MF muon.p/src_platform_posix_log.c.o.d -o muon.p/src_platform_posix_log.c.o -c ../muon-v0.4.0/src/platform/posix/log.c >[91/131] riscv64-unknown-linux-gnu-gcc -Imuon.p -I. -I../muon-v0.4.0 -I../muon-v0.4.0/include -Isubprojects/tinyjson -I../muon-v0.4.0/subprojects/tinyjson -Isubprojects/bestline -I../muon-v0.4.0/subprojects/bestline -Isrc/script -I/usr/include/pkgconf -fdiagnostics-color=always -D_FILE_OFFSET_BITS=64 -Wall -Winvalid-pch -Wextra -Wpedantic -Wendif-labels -Wimplicit-fallthrough=2 -Winit-self -Wlogical-op -Wmissing-include-dirs -Wno-missing-braces -Wno-missing-field-initializers -Wno-unused-parameter -Wold-style-definition -Woverflow -Wstrict-aliasing=2 -Wstrict-prototypes -Wundef -Wvla -fstrict-aliasing -std=c99 -DMUON_BOOTSTRAPPED -O2 -pipe -DMUON_PLATFORM_posix -DMUON_ENDIAN=0 -MD -MQ muon.p/src_platform_posix_init.c.o -MF muon.p/src_platform_posix_init.c.o.d -o muon.p/src_platform_posix_init.c.o -c ../muon-v0.4.0/src/platform/posix/init.c >[92/131] riscv64-unknown-linux-gnu-gcc -Imuon.p -I. -I../muon-v0.4.0 -I../muon-v0.4.0/include -Isubprojects/tinyjson -I../muon-v0.4.0/subprojects/tinyjson -Isubprojects/bestline -I../muon-v0.4.0/subprojects/bestline -Isrc/script -I/usr/include/pkgconf -fdiagnostics-color=always -D_FILE_OFFSET_BITS=64 -Wall -Winvalid-pch -Wextra -Wpedantic -Wendif-labels -Wimplicit-fallthrough=2 -Winit-self -Wlogical-op -Wmissing-include-dirs -Wno-missing-braces -Wno-missing-field-initializers -Wno-unused-parameter -Wold-style-definition -Woverflow -Wstrict-aliasing=2 -Wstrict-prototypes -Wundef -Wvla -fstrict-aliasing -std=c99 -DMUON_BOOTSTRAPPED -O2 -pipe -DMUON_PLATFORM_posix -DMUON_ENDIAN=0 -MD -MQ muon.p/meson-generated_.._src_version.c.o -MF muon.p/meson-generated_.._src_version.c.o.d -o muon.p/meson-generated_.._src_version.c.o -c src/version.c >[93/131] riscv64-unknown-linux-gnu-gcc -Imuon.p -I. -I../muon-v0.4.0 -I../muon-v0.4.0/include -Isubprojects/tinyjson -I../muon-v0.4.0/subprojects/tinyjson -Isubprojects/bestline -I../muon-v0.4.0/subprojects/bestline -Isrc/script -I/usr/include/pkgconf -fdiagnostics-color=always -D_FILE_OFFSET_BITS=64 -Wall -Winvalid-pch -Wextra -Wpedantic -Wendif-labels -Wimplicit-fallthrough=2 -Winit-self -Wlogical-op -Wmissing-include-dirs -Wno-missing-braces -Wno-missing-field-initializers -Wno-unused-parameter -Wold-style-definition -Woverflow -Wstrict-aliasing=2 -Wstrict-prototypes -Wundef -Wvla -fstrict-aliasing -std=c99 -DMUON_BOOTSTRAPPED -O2 -pipe -DMUON_PLATFORM_posix -DMUON_ENDIAN=0 -MD -MQ muon.p/src_platform_run_cmd.c.o -MF muon.p/src_platform_run_cmd.c.o.d -o muon.p/src_platform_run_cmd.c.o -c ../muon-v0.4.0/src/platform/run_cmd.c >[94/131] riscv64-unknown-linux-gnu-gcc -Imuon.p -I. -I../muon-v0.4.0 -I../muon-v0.4.0/include -Isubprojects/tinyjson -I../muon-v0.4.0/subprojects/tinyjson -Isubprojects/bestline -I../muon-v0.4.0/subprojects/bestline -Isrc/script -I/usr/include/pkgconf -fdiagnostics-color=always -D_FILE_OFFSET_BITS=64 -Wall -Winvalid-pch -Wextra -Wpedantic -Wendif-labels -Wimplicit-fallthrough=2 -Winit-self -Wlogical-op -Wmissing-include-dirs -Wno-missing-braces -Wno-missing-field-initializers -Wno-unused-parameter -Wold-style-definition -Woverflow -Wstrict-aliasing=2 -Wstrict-prototypes -Wundef -Wvla -fstrict-aliasing -std=c99 -DMUON_BOOTSTRAPPED -O2 -pipe -DMUON_PLATFORM_posix -DMUON_ENDIAN=0 -MD -MQ muon.p/src_lang_lexer.c.o -MF muon.p/src_lang_lexer.c.o.d -o muon.p/src_lang_lexer.c.o -c ../muon-v0.4.0/src/lang/lexer.c >[95/131] riscv64-unknown-linux-gnu-gcc -Imuon.p -I. -I../muon-v0.4.0 -I../muon-v0.4.0/include -Isubprojects/tinyjson -I../muon-v0.4.0/subprojects/tinyjson -Isubprojects/bestline -I../muon-v0.4.0/subprojects/bestline -Isrc/script -I/usr/include/pkgconf -fdiagnostics-color=always -D_FILE_OFFSET_BITS=64 -Wall -Winvalid-pch -Wextra -Wpedantic -Wendif-labels -Wimplicit-fallthrough=2 -Winit-self -Wlogical-op -Wmissing-include-dirs -Wno-missing-braces -Wno-missing-field-initializers -Wno-unused-parameter -Wold-style-definition -Woverflow -Wstrict-aliasing=2 -Wstrict-prototypes -Wundef -Wvla -fstrict-aliasing -std=c99 -DMUON_BOOTSTRAPPED -O2 -pipe -DMUON_PLATFORM_posix -DMUON_ENDIAN=0 -MD -MQ muon.p/src_platform_posix_path.c.o -MF muon.p/src_platform_posix_path.c.o.d -o muon.p/src_platform_posix_path.c.o -c ../muon-v0.4.0/src/platform/posix/path.c >[96/131] riscv64-unknown-linux-gnu-gcc -Imuon.p -I. -I../muon-v0.4.0 -I../muon-v0.4.0/include -Isubprojects/tinyjson -I../muon-v0.4.0/subprojects/tinyjson -Isubprojects/bestline -I../muon-v0.4.0/subprojects/bestline -Isrc/script -I/usr/include/pkgconf -fdiagnostics-color=always -D_FILE_OFFSET_BITS=64 -Wall -Winvalid-pch -Wextra -Wpedantic -Wendif-labels -Wimplicit-fallthrough=2 -Winit-self -Wlogical-op -Wmissing-include-dirs -Wno-missing-braces -Wno-missing-field-initializers -Wno-unused-parameter -Wold-style-definition -Woverflow -Wstrict-aliasing=2 -Wstrict-prototypes -Wundef -Wvla -fstrict-aliasing -std=c99 -DMUON_BOOTSTRAPPED -O2 -pipe -DMUON_PLATFORM_posix -DMUON_ENDIAN=0 -MD -MQ muon.p/src_platform_posix_term.c.o -MF muon.p/src_platform_posix_term.c.o.d -o muon.p/src_platform_posix_term.c.o -c ../muon-v0.4.0/src/platform/posix/term.c >[97/131] riscv64-unknown-linux-gnu-gcc -Imuon.p -I. -I../muon-v0.4.0 -I../muon-v0.4.0/include -Isubprojects/tinyjson -I../muon-v0.4.0/subprojects/tinyjson -Isubprojects/bestline -I../muon-v0.4.0/subprojects/bestline -Isrc/script -I/usr/include/pkgconf -fdiagnostics-color=always -D_FILE_OFFSET_BITS=64 -Wall -Winvalid-pch -Wextra -Wpedantic -Wendif-labels -Wimplicit-fallthrough=2 -Winit-self -Wlogical-op -Wmissing-include-dirs -Wno-missing-braces -Wno-missing-field-initializers -Wno-unused-parameter -Wold-style-definition -Woverflow -Wstrict-aliasing=2 -Wstrict-prototypes -Wundef -Wvla -fstrict-aliasing -std=c99 -DMUON_BOOTSTRAPPED -O2 -pipe -DMUON_PLATFORM_posix -DMUON_ENDIAN=0 -MD -MQ muon.p/src_platform_posix_timer.c.o -MF muon.p/src_platform_posix_timer.c.o.d -o muon.p/src_platform_posix_timer.c.o -c ../muon-v0.4.0/src/platform/posix/timer.c >[98/131] riscv64-unknown-linux-gnu-gcc -Imuon.p -I. -I../muon-v0.4.0 -I../muon-v0.4.0/include -Isubprojects/tinyjson -I../muon-v0.4.0/subprojects/tinyjson -Isubprojects/bestline -I../muon-v0.4.0/subprojects/bestline -Isrc/script -I/usr/include/pkgconf -fdiagnostics-color=always -D_FILE_OFFSET_BITS=64 -Wall -Winvalid-pch -Wextra -Wpedantic -Wendif-labels -Wimplicit-fallthrough=2 -Winit-self -Wlogical-op -Wmissing-include-dirs -Wno-missing-braces -Wno-missing-field-initializers -Wno-unused-parameter -Wold-style-definition -Woverflow -Wstrict-aliasing=2 -Wstrict-prototypes -Wundef -Wvla -fstrict-aliasing -std=c99 -DMUON_BOOTSTRAPPED -O2 -pipe -DMUON_PLATFORM_posix -DMUON_ENDIAN=0 -MD -MQ muon.p/src_platform_posix_os.c.o -MF muon.p/src_platform_posix_os.c.o.d -o muon.p/src_platform_posix_os.c.o -c ../muon-v0.4.0/src/platform/posix/os.c >[99/131] riscv64-unknown-linux-gnu-gcc -Imuon.p -I. -I../muon-v0.4.0 -I../muon-v0.4.0/include -Isubprojects/tinyjson -I../muon-v0.4.0/subprojects/tinyjson -Isubprojects/bestline -I../muon-v0.4.0/subprojects/bestline -Isrc/script -I/usr/include/pkgconf -fdiagnostics-color=always -D_FILE_OFFSET_BITS=64 -Wall -Winvalid-pch -Wextra -Wpedantic -Wendif-labels -Wimplicit-fallthrough=2 -Winit-self -Wlogical-op -Wmissing-include-dirs -Wno-missing-braces -Wno-missing-field-initializers -Wno-unused-parameter -Wold-style-definition -Woverflow -Wstrict-aliasing=2 -Wstrict-prototypes -Wundef -Wvla -fstrict-aliasing -std=c99 -DMUON_BOOTSTRAPPED -O2 -pipe -DMUON_PLATFORM_posix -DMUON_ENDIAN=0 -MD -MQ muon.p/src_lang_string.c.o -MF muon.p/src_lang_string.c.o.d -o muon.p/src_lang_string.c.o -c ../muon-v0.4.0/src/lang/string.c >[100/131] riscv64-unknown-linux-gnu-gcc -Imuon.p -I. -I../muon-v0.4.0 -I../muon-v0.4.0/include -Isubprojects/tinyjson -I../muon-v0.4.0/subprojects/tinyjson -Isubprojects/bestline -I../muon-v0.4.0/subprojects/bestline -Isrc/script -I/usr/include/pkgconf -fdiagnostics-color=always -D_FILE_OFFSET_BITS=64 -Wall -Winvalid-pch -Wextra -Wpedantic -Wendif-labels -Wimplicit-fallthrough=2 -Winit-self -Wlogical-op -Wmissing-include-dirs -Wno-missing-braces -Wno-missing-field-initializers -Wno-unused-parameter -Wold-style-definition -Woverflow -Wstrict-aliasing=2 -Wstrict-prototypes -Wundef -Wvla -fstrict-aliasing -std=c99 -DMUON_BOOTSTRAPPED -O2 -pipe -DMUON_PLATFORM_posix -DMUON_ENDIAN=0 -MD -MQ muon.p/src_functions_kernel_build_target.c.o -MF muon.p/src_functions_kernel_build_target.c.o.d -o muon.p/src_functions_kernel_build_target.c.o -c ../muon-v0.4.0/src/functions/kernel/build_target.c >[101/131] riscv64-unknown-linux-gnu-gcc -Imuon.p -I. -I../muon-v0.4.0 -I../muon-v0.4.0/include -Isubprojects/tinyjson -I../muon-v0.4.0/subprojects/tinyjson -Isubprojects/bestline -I../muon-v0.4.0/subprojects/bestline -Isrc/script -I/usr/include/pkgconf -fdiagnostics-color=always -D_FILE_OFFSET_BITS=64 -Wall -Winvalid-pch -Wextra -Wpedantic -Wendif-labels -Wimplicit-fallthrough=2 -Winit-self -Wlogical-op -Wmissing-include-dirs -Wno-missing-braces -Wno-missing-field-initializers -Wno-unused-parameter -Wold-style-definition -Woverflow -Wstrict-aliasing=2 -Wstrict-prototypes -Wundef -Wvla -fstrict-aliasing -std=c99 -DMUON_BOOTSTRAPPED -O2 -pipe -DMUON_PLATFORM_posix -DMUON_ENDIAN=0 -MD -MQ muon.p/src_cmd_test.c.o -MF muon.p/src_cmd_test.c.o.d -o muon.p/src_cmd_test.c.o -c ../muon-v0.4.0/src/cmd_test.c >[102/131] riscv64-unknown-linux-gnu-gcc -Imuon.p -I. -I../muon-v0.4.0 -I../muon-v0.4.0/include -Isubprojects/tinyjson -I../muon-v0.4.0/subprojects/tinyjson -Isubprojects/bestline -I../muon-v0.4.0/subprojects/bestline -Isrc/script -I/usr/include/pkgconf -fdiagnostics-color=always -D_FILE_OFFSET_BITS=64 -Wall -Winvalid-pch -Wextra -Wpedantic -Wendif-labels -Wimplicit-fallthrough=2 -Winit-self -Wlogical-op -Wmissing-include-dirs -Wno-missing-braces -Wno-missing-field-initializers -Wno-unused-parameter -Wold-style-definition -Woverflow -Wstrict-aliasing=2 -Wstrict-prototypes -Wundef -Wvla -fstrict-aliasing -std=c99 -DMUON_BOOTSTRAPPED -O2 -pipe -DMUON_PLATFORM_posix -DMUON_ENDIAN=0 -MD -MQ muon.p/src_platform_posix_uname.c.o -MF muon.p/src_platform_posix_uname.c.o.d -o muon.p/src_platform_posix_uname.c.o -c ../muon-v0.4.0/src/platform/posix/uname.c >[103/131] riscv64-unknown-linux-gnu-gcc -Imuon.p -I. -I../muon-v0.4.0 -I../muon-v0.4.0/include -Isubprojects/tinyjson -I../muon-v0.4.0/subprojects/tinyjson -Isubprojects/bestline -I../muon-v0.4.0/subprojects/bestline -Isrc/script -I/usr/include/pkgconf -fdiagnostics-color=always -D_FILE_OFFSET_BITS=64 -Wall -Winvalid-pch -Wextra -Wpedantic -Wendif-labels -Wimplicit-fallthrough=2 -Winit-self -Wlogical-op -Wmissing-include-dirs -Wno-missing-braces -Wno-missing-field-initializers -Wno-unused-parameter -Wold-style-definition -Woverflow -Wstrict-aliasing=2 -Wstrict-prototypes -Wundef -Wvla -fstrict-aliasing -std=c99 -DMUON_BOOTSTRAPPED -O2 -pipe -DMUON_PLATFORM_posix -DMUON_ENDIAN=0 -MD -MQ muon.p/src_functions_kernel_dependency.c.o -MF muon.p/src_functions_kernel_dependency.c.o.d -o muon.p/src_functions_kernel_dependency.c.o -c ../muon-v0.4.0/src/functions/kernel/dependency.c >[104/131] riscv64-unknown-linux-gnu-gcc -Imuon.p -I. -I../muon-v0.4.0 -I../muon-v0.4.0/include -Isubprojects/tinyjson -I../muon-v0.4.0/subprojects/tinyjson -Isubprojects/bestline -I../muon-v0.4.0/subprojects/bestline -Isrc/script -I/usr/include/pkgconf -fdiagnostics-color=always -D_FILE_OFFSET_BITS=64 -Wall -Winvalid-pch -Wextra -Wpedantic -Wendif-labels -Wimplicit-fallthrough=2 -Winit-self -Wlogical-op -Wmissing-include-dirs -Wno-missing-braces -Wno-missing-field-initializers -Wno-unused-parameter -Wold-style-definition -Woverflow -Wstrict-aliasing=2 -Wstrict-prototypes -Wundef -Wvla -fstrict-aliasing -std=c99 -DMUON_BOOTSTRAPPED -O2 -pipe -DMUON_PLATFORM_posix -DMUON_ENDIAN=0 -MD -MQ muon.p/src_external_samurai_null.c.o -MF muon.p/src_external_samurai_null.c.o.d -o muon.p/src_external_samurai_null.c.o -c ../muon-v0.4.0/src/external/samurai_null.c >[105/131] riscv64-unknown-linux-gnu-gcc -Imuon.p -I. -I../muon-v0.4.0 -I../muon-v0.4.0/include -Isubprojects/tinyjson -I../muon-v0.4.0/subprojects/tinyjson -Isubprojects/bestline -I../muon-v0.4.0/subprojects/bestline -Isrc/script -I/usr/include/pkgconf -fdiagnostics-color=always -D_FILE_OFFSET_BITS=64 -Wall -Winvalid-pch -Wextra -Wpedantic -Wendif-labels -Wimplicit-fallthrough=2 -Winit-self -Wlogical-op -Wmissing-include-dirs -Wno-missing-braces -Wno-missing-field-initializers -Wno-unused-parameter -Wold-style-definition -Woverflow -Wstrict-aliasing=2 -Wstrict-prototypes -Wundef -Wvla -fstrict-aliasing -std=c99 -DMUON_BOOTSTRAPPED -O2 -pipe -DMUON_PLATFORM_posix -DMUON_ENDIAN=0 -MD -MQ muon.p/src_ui_null.c.o -MF muon.p/src_ui_null.c.o.d -o muon.p/src_ui_null.c.o -c ../muon-v0.4.0/src/ui_null.c >[106/131] riscv64-unknown-linux-gnu-gcc -Imuon.p -I. -I../muon-v0.4.0 -I../muon-v0.4.0/include -Isubprojects/tinyjson -I../muon-v0.4.0/subprojects/tinyjson -Isubprojects/bestline -I../muon-v0.4.0/subprojects/bestline -Isrc/script -I/usr/include/pkgconf -fdiagnostics-color=always -D_FILE_OFFSET_BITS=64 -Wall -Winvalid-pch -Wextra -Wpedantic -Wendif-labels -Wimplicit-fallthrough=2 -Winit-self -Wlogical-op -Wmissing-include-dirs -Wno-missing-braces -Wno-missing-field-initializers -Wno-unused-parameter -Wold-style-definition -Woverflow -Wstrict-aliasing=2 -Wstrict-prototypes -Wundef -Wvla -fstrict-aliasing -std=c99 -DMUON_BOOTSTRAPPED -O2 -pipe -DMUON_PLATFORM_posix -DMUON_ENDIAN=0 -MD -MQ muon.p/src_external_readline_bestline.c.o -MF muon.p/src_external_readline_bestline.c.o.d -o muon.p/src_external_readline_bestline.c.o -c ../muon-v0.4.0/src/external/readline_bestline.c >[107/131] riscv64-unknown-linux-gnu-gcc -Imuon.p -I. -I../muon-v0.4.0 -I../muon-v0.4.0/include -Isubprojects/tinyjson -I../muon-v0.4.0/subprojects/tinyjson -Isubprojects/bestline -I../muon-v0.4.0/subprojects/bestline -Isrc/script -I/usr/include/pkgconf -fdiagnostics-color=always -D_FILE_OFFSET_BITS=64 -Wall -Winvalid-pch -Wextra -Wpedantic -Wendif-labels -Wimplicit-fallthrough=2 -Winit-self -Wlogical-op -Wmissing-include-dirs -Wno-missing-braces -Wno-missing-field-initializers -Wno-unused-parameter -Wold-style-definition -Woverflow -Wstrict-aliasing=2 -Wstrict-prototypes -Wundef -Wvla -fstrict-aliasing -std=c99 -DMUON_BOOTSTRAPPED -O2 -pipe -DMUON_PLATFORM_posix -DMUON_ENDIAN=0 -MD -MQ muon.p/src_external_tinyjson.c.o -MF muon.p/src_external_tinyjson.c.o.d -o muon.p/src_external_tinyjson.c.o -c ../muon-v0.4.0/src/external/tinyjson.c >[108/131] riscv64-unknown-linux-gnu-gcc -Imuon.p -I. -I../muon-v0.4.0 -I../muon-v0.4.0/include -Isubprojects/tinyjson -I../muon-v0.4.0/subprojects/tinyjson -Isubprojects/bestline -I../muon-v0.4.0/subprojects/bestline -Isrc/script -I/usr/include/pkgconf -fdiagnostics-color=always -D_FILE_OFFSET_BITS=64 -Wall -Winvalid-pch -Wextra -Wpedantic -Wendif-labels -Wimplicit-fallthrough=2 -Winit-self -Wlogical-op -Wmissing-include-dirs -Wno-missing-braces -Wno-missing-field-initializers -Wno-unused-parameter -Wold-style-definition -Woverflow -Wstrict-aliasing=2 -Wstrict-prototypes -Wundef -Wvla -fstrict-aliasing -std=c99 -DMUON_BOOTSTRAPPED -O2 -pipe -DMUON_PLATFORM_posix -DMUON_ENDIAN=0 -MD -MQ muon.p/src_external_libarchive.c.o -MF muon.p/src_external_libarchive.c.o.d -o muon.p/src_external_libarchive.c.o -c ../muon-v0.4.0/src/external/libarchive.c >[109/131] riscv64-unknown-linux-gnu-gcc -Imuon.p -I. -I../muon-v0.4.0 -I../muon-v0.4.0/include -Isubprojects/tinyjson -I../muon-v0.4.0/subprojects/tinyjson -Isubprojects/bestline -I../muon-v0.4.0/subprojects/bestline -Isrc/script -I/usr/include/pkgconf -fdiagnostics-color=always -D_FILE_OFFSET_BITS=64 -Wall -Winvalid-pch -Wextra -Wpedantic -Wendif-labels -Wimplicit-fallthrough=2 -Winit-self -Wlogical-op -Wmissing-include-dirs -Wno-missing-braces -Wno-missing-field-initializers -Wno-unused-parameter -Wold-style-definition -Woverflow -Wstrict-aliasing=2 -Wstrict-prototypes -Wundef -Wvla -fstrict-aliasing -std=c99 -DMUON_BOOTSTRAPPED -O2 -pipe -DMUON_PLATFORM_posix -DMUON_ENDIAN=0 -MD -MQ muon.p/src_platform_path.c.o -MF muon.p/src_platform_path.c.o.d -o muon.p/src_platform_path.c.o -c ../muon-v0.4.0/src/platform/path.c >[110/131] riscv64-unknown-linux-gnu-gcc -Imuon.p -I. -I../muon-v0.4.0 -I../muon-v0.4.0/include -Isubprojects/tinyjson -I../muon-v0.4.0/subprojects/tinyjson -Isubprojects/bestline -I../muon-v0.4.0/subprojects/bestline -Isrc/script -I/usr/include/pkgconf -fdiagnostics-color=always -D_FILE_OFFSET_BITS=64 -Wall -Winvalid-pch -Wextra -Wpedantic -Wendif-labels -Wimplicit-fallthrough=2 -Winit-self -Wlogical-op -Wmissing-include-dirs -Wno-missing-braces -Wno-missing-field-initializers -Wno-unused-parameter -Wold-style-definition -Woverflow -Wstrict-aliasing=2 -Wstrict-prototypes -Wundef -Wvla -fstrict-aliasing -std=c99 -DMUON_BOOTSTRAPPED -O2 -pipe -DMUON_PLATFORM_posix -DMUON_ENDIAN=0 -MD -MQ muon.p/src_external_libcurl.c.o -MF muon.p/src_external_libcurl.c.o.d -o muon.p/src_external_libcurl.c.o -c ../muon-v0.4.0/src/external/libcurl.c >[111/131] riscv64-unknown-linux-gnu-gcc -Imuon.p -I. -I../muon-v0.4.0 -I../muon-v0.4.0/include -Isubprojects/tinyjson -I../muon-v0.4.0/subprojects/tinyjson -Isubprojects/bestline -I../muon-v0.4.0/subprojects/bestline -Isrc/script -I/usr/include/pkgconf -fdiagnostics-color=always -D_FILE_OFFSET_BITS=64 -Wall -Winvalid-pch -Wextra -Wpedantic -Wendif-labels -Wimplicit-fallthrough=2 -Winit-self -Wlogical-op -Wmissing-include-dirs -Wno-missing-braces -Wno-missing-field-initializers -Wno-unused-parameter -Wold-style-definition -Woverflow -Wstrict-aliasing=2 -Wstrict-prototypes -Wundef -Wvla -fstrict-aliasing -std=c99 -DMUON_BOOTSTRAPPED -O2 -pipe -DMUON_PLATFORM_posix -DMUON_ENDIAN=0 -MD -MQ muon.p/src_lang_compiler.c.o -MF muon.p/src_lang_compiler.c.o.d -o muon.p/src_lang_compiler.c.o -c ../muon-v0.4.0/src/lang/compiler.c >[112/131] riscv64-unknown-linux-gnu-gcc -Imuon.p -I. -I../muon-v0.4.0 -I../muon-v0.4.0/include -Isubprojects/tinyjson -I../muon-v0.4.0/subprojects/tinyjson -Isubprojects/bestline -I../muon-v0.4.0/subprojects/bestline -Isrc/script -I/usr/include/pkgconf -fdiagnostics-color=always -D_FILE_OFFSET_BITS=64 -Wall -Winvalid-pch -Wextra -Wpedantic -Wendif-labels -Wimplicit-fallthrough=2 -Winit-self -Wlogical-op -Wmissing-include-dirs -Wno-missing-braces -Wno-missing-field-initializers -Wno-unused-parameter -Wold-style-definition -Woverflow -Wstrict-aliasing=2 -Wstrict-prototypes -Wundef -Wvla -fstrict-aliasing -std=c99 -DMUON_BOOTSTRAPPED -O2 -pipe -DMUON_PLATFORM_posix -DMUON_ENDIAN=0 -MD -MQ muon.p/src_platform_posix_filesystem.c.o -MF muon.p/src_platform_posix_filesystem.c.o.d -o muon.p/src_platform_posix_filesystem.c.o -c ../muon-v0.4.0/src/platform/posix/filesystem.c >[113/131] riscv64-unknown-linux-gnu-gcc -Imuon.p -I. -I../muon-v0.4.0 -I../muon-v0.4.0/include -Isubprojects/tinyjson -I../muon-v0.4.0/subprojects/tinyjson -Isubprojects/bestline -I../muon-v0.4.0/subprojects/bestline -Isrc/script -I/usr/include/pkgconf -fdiagnostics-color=always -D_FILE_OFFSET_BITS=64 -Wall -Winvalid-pch -Wextra -Wpedantic -Wendif-labels -Wimplicit-fallthrough=2 -Winit-self -Wlogical-op -Wmissing-include-dirs -Wno-missing-braces -Wno-missing-field-initializers -Wno-unused-parameter -Wold-style-definition -Woverflow -Wstrict-aliasing=2 -Wstrict-prototypes -Wundef -Wvla -fstrict-aliasing -std=c99 -DMUON_BOOTSTRAPPED -O2 -pipe -DMUON_PLATFORM_posix -DMUON_ENDIAN=0 -MD -MQ muon.p/src_platform_filesystem.c.o -MF muon.p/src_platform_filesystem.c.o.d -o muon.p/src_platform_filesystem.c.o -c ../muon-v0.4.0/src/platform/filesystem.c >[114/131] riscv64-unknown-linux-gnu-gcc -Imuon.p -I. -I../muon-v0.4.0 -I../muon-v0.4.0/include -Isubprojects/tinyjson -I../muon-v0.4.0/subprojects/tinyjson -Isubprojects/bestline -I../muon-v0.4.0/subprojects/bestline -Isrc/script -I/usr/include/pkgconf -fdiagnostics-color=always -D_FILE_OFFSET_BITS=64 -Wall -Winvalid-pch -Wextra -Wpedantic -Wendif-labels -Wimplicit-fallthrough=2 -Winit-self -Wlogical-op -Wmissing-include-dirs -Wno-missing-braces -Wno-missing-field-initializers -Wno-unused-parameter -Wold-style-definition -Woverflow -Wstrict-aliasing=2 -Wstrict-prototypes -Wundef -Wvla -fstrict-aliasing -std=c99 -DMUON_BOOTSTRAPPED -O2 -pipe -DMUON_PLATFORM_posix -DMUON_ENDIAN=0 -MD -MQ muon.p/src_platform_posix_rpath_fixer.c.o -MF muon.p/src_platform_posix_rpath_fixer.c.o.d -o muon.p/src_platform_posix_rpath_fixer.c.o -c ../muon-v0.4.0/src/platform/posix/rpath_fixer.c >[115/131] riscv64-unknown-linux-gnu-gcc -Imuon.p -I. -I../muon-v0.4.0 -I../muon-v0.4.0/include -Isubprojects/tinyjson -I../muon-v0.4.0/subprojects/tinyjson -Isubprojects/bestline -I../muon-v0.4.0/subprojects/bestline -Isrc/script -I/usr/include/pkgconf -fdiagnostics-color=always -D_FILE_OFFSET_BITS=64 -Wall -Winvalid-pch -Wextra -Wpedantic -Wendif-labels -Wimplicit-fallthrough=2 -Winit-self -Wlogical-op -Wmissing-include-dirs -Wno-missing-braces -Wno-missing-field-initializers -Wno-unused-parameter -Wold-style-definition -Woverflow -Wstrict-aliasing=2 -Wstrict-prototypes -Wundef -Wvla -fstrict-aliasing -std=c99 -DMUON_BOOTSTRAPPED -O2 -pipe -DMUON_PLATFORM_posix -DMUON_ENDIAN=0 -MD -MQ muon.p/src_external_libpkgconf.c.o -MF muon.p/src_external_libpkgconf.c.o.d -o muon.p/src_external_libpkgconf.c.o -c ../muon-v0.4.0/src/external/libpkgconf.c >[116/131] riscv64-unknown-linux-gnu-gcc -Imuon.p -I. -I../muon-v0.4.0 -I../muon-v0.4.0/include -Isubprojects/tinyjson -I../muon-v0.4.0/subprojects/tinyjson -Isubprojects/bestline -I../muon-v0.4.0/subprojects/bestline -Isrc/script -I/usr/include/pkgconf -fdiagnostics-color=always -D_FILE_OFFSET_BITS=64 -Wall -Winvalid-pch -Wextra -Wpedantic -Wendif-labels -Wimplicit-fallthrough=2 -Winit-self -Wlogical-op -Wmissing-include-dirs -Wno-missing-braces -Wno-missing-field-initializers -Wno-unused-parameter -Wold-style-definition -Woverflow -Wstrict-aliasing=2 -Wstrict-prototypes -Wundef -Wvla -fstrict-aliasing -std=c99 -DMUON_BOOTSTRAPPED -O2 -pipe -DMUON_PLATFORM_posix -DMUON_ENDIAN=0 -MD -MQ muon.p/src_functions_kernel.c.o -MF muon.p/src_functions_kernel.c.o.d -o muon.p/src_functions_kernel.c.o -c ../muon-v0.4.0/src/functions/kernel.c >[117/131] riscv64-unknown-linux-gnu-gcc -Imuon.p -I. -I../muon-v0.4.0 -I../muon-v0.4.0/include -Isubprojects/tinyjson -I../muon-v0.4.0/subprojects/tinyjson -Isubprojects/bestline -I../muon-v0.4.0/subprojects/bestline -Isrc/script -I/usr/include/pkgconf -fdiagnostics-color=always -D_FILE_OFFSET_BITS=64 -Wall -Winvalid-pch -Wextra -Wpedantic -Wendif-labels -Wimplicit-fallthrough=2 -Winit-self -Wlogical-op -Wmissing-include-dirs -Wno-missing-braces -Wno-missing-field-initializers -Wno-unused-parameter -Wold-style-definition -Woverflow -Wstrict-aliasing=2 -Wstrict-prototypes -Wundef -Wvla -fstrict-aliasing -std=c99 -DMUON_BOOTSTRAPPED -O2 -pipe -DMUON_PLATFORM_posix -DMUON_ENDIAN=0 -MD -MQ muon.p/src_wrap.c.o -MF muon.p/src_wrap.c.o.d -o muon.p/src_wrap.c.o -c ../muon-v0.4.0/src/wrap.c >[118/131] riscv64-unknown-linux-gnu-gcc -Imuon.p -I. -I../muon-v0.4.0 -I../muon-v0.4.0/include -Isubprojects/tinyjson -I../muon-v0.4.0/subprojects/tinyjson -Isubprojects/bestline -I../muon-v0.4.0/subprojects/bestline -Isrc/script -I/usr/include/pkgconf -fdiagnostics-color=always -D_FILE_OFFSET_BITS=64 -Wall -Winvalid-pch -Wextra -Wpedantic -Wendif-labels -Wimplicit-fallthrough=2 -Winit-self -Wlogical-op -Wmissing-include-dirs -Wno-missing-braces -Wno-missing-field-initializers -Wno-unused-parameter -Wold-style-definition -Woverflow -Wstrict-aliasing=2 -Wstrict-prototypes -Wundef -Wvla -fstrict-aliasing -std=c99 -DMUON_BOOTSTRAPPED -O2 -pipe -DMUON_PLATFORM_posix -DMUON_ENDIAN=0 -MD -MQ muon.p/src_platform_posix_run_cmd.c.o -MF muon.p/src_platform_posix_run_cmd.c.o.d -o muon.p/src_platform_posix_run_cmd.c.o -c ../muon-v0.4.0/src/platform/posix/run_cmd.c >[119/131] riscv64-unknown-linux-gnu-gcc -Imuon.p -I. -I../muon-v0.4.0 -I../muon-v0.4.0/include -Isubprojects/tinyjson -I../muon-v0.4.0/subprojects/tinyjson -Isubprojects/bestline -I../muon-v0.4.0/subprojects/bestline -Isrc/script -I/usr/include/pkgconf -fdiagnostics-color=always -D_FILE_OFFSET_BITS=64 -Wall -Winvalid-pch -Wextra -Wpedantic -Wendif-labels -Wimplicit-fallthrough=2 -Winit-self -Wlogical-op -Wmissing-include-dirs -Wno-missing-braces -Wno-missing-field-initializers -Wno-unused-parameter -Wold-style-definition -Woverflow -Wstrict-aliasing=2 -Wstrict-prototypes -Wundef -Wvla -fstrict-aliasing -std=c99 -DMUON_BOOTSTRAPPED -O2 -pipe -DMUON_PLATFORM_posix -DMUON_ENDIAN=0 -MD -MQ muon.p/src_functions_compiler.c.o -MF muon.p/src_functions_compiler.c.o.d -o muon.p/src_functions_compiler.c.o -c ../muon-v0.4.0/src/functions/compiler.c >[120/131] riscv64-unknown-linux-gnu-gcc -Imuon.p -I. -I../muon-v0.4.0 -I../muon-v0.4.0/include -Isubprojects/tinyjson -I../muon-v0.4.0/subprojects/tinyjson -Isubprojects/bestline -I../muon-v0.4.0/subprojects/bestline -Isrc/script -I/usr/include/pkgconf -fdiagnostics-color=always -D_FILE_OFFSET_BITS=64 -Wall -Winvalid-pch -Wextra -Wpedantic -Wendif-labels -Wimplicit-fallthrough=2 -Winit-self -Wlogical-op -Wmissing-include-dirs -Wno-missing-braces -Wno-missing-field-initializers -Wno-unused-parameter -Wold-style-definition -Woverflow -Wstrict-aliasing=2 -Wstrict-prototypes -Wundef -Wvla -fstrict-aliasing -std=c99 -DMUON_BOOTSTRAPPED -O2 -pipe -DMUON_PLATFORM_posix -DMUON_ENDIAN=0 -MD -MQ muon.p/src_meson_opts.c.o -MF muon.p/src_meson_opts.c.o.d -o muon.p/src_meson_opts.c.o -c ../muon-v0.4.0/src/meson_opts.c >[121/131] riscv64-unknown-linux-gnu-gcc -Imuon.p -I. -I../muon-v0.4.0 -I../muon-v0.4.0/include -Isubprojects/tinyjson -I../muon-v0.4.0/subprojects/tinyjson -Isubprojects/bestline -I../muon-v0.4.0/subprojects/bestline -Isrc/script -I/usr/include/pkgconf -fdiagnostics-color=always -D_FILE_OFFSET_BITS=64 -Wall -Winvalid-pch -Wextra -Wpedantic -Wendif-labels -Wimplicit-fallthrough=2 -Winit-self -Wlogical-op -Wmissing-include-dirs -Wno-missing-braces -Wno-missing-field-initializers -Wno-unused-parameter -Wold-style-definition -Woverflow -Wstrict-aliasing=2 -Wstrict-prototypes -Wundef -Wvla -fstrict-aliasing -std=c99 -DMUON_BOOTSTRAPPED -O2 -pipe -DMUON_PLATFORM_posix -DMUON_ENDIAN=0 -MD -MQ muon.p/src_lang_parser.c.o -MF muon.p/src_lang_parser.c.o.d -o muon.p/src_lang_parser.c.o -c ../muon-v0.4.0/src/lang/parser.c >[122/131] riscv64-unknown-linux-gnu-gcc -Imuon.p -I. -I../muon-v0.4.0 -I../muon-v0.4.0/include -Isubprojects/tinyjson -I../muon-v0.4.0/subprojects/tinyjson -Isubprojects/bestline -I../muon-v0.4.0/subprojects/bestline -Isrc/script -I/usr/include/pkgconf -fdiagnostics-color=always -D_FILE_OFFSET_BITS=64 -Wall -Winvalid-pch -Wextra -Wpedantic -Wendif-labels -Wimplicit-fallthrough=2 -Winit-self -Wlogical-op -Wmissing-include-dirs -Wno-missing-braces -Wno-missing-field-initializers -Wno-unused-parameter -Wold-style-definition -Woverflow -Wstrict-aliasing=2 -Wstrict-prototypes -Wundef -Wvla -fstrict-aliasing -std=c99 -DMUON_BOOTSTRAPPED -O2 -pipe -DMUON_PLATFORM_posix -DMUON_ENDIAN=0 -MD -MQ muon.p/src_lang_fmt.c.o -MF muon.p/src_lang_fmt.c.o.d -o muon.p/src_lang_fmt.c.o -c ../muon-v0.4.0/src/lang/fmt.c >[123/131] riscv64-unknown-linux-gnu-gcc -Imuon.p -I. -I../muon-v0.4.0 -I../muon-v0.4.0/include -Isubprojects/tinyjson -I../muon-v0.4.0/subprojects/tinyjson -Isubprojects/bestline -I../muon-v0.4.0/subprojects/bestline -Isrc/script -I/usr/include/pkgconf -fdiagnostics-color=always -D_FILE_OFFSET_BITS=64 -Wall -Winvalid-pch -Wextra -Wpedantic -Wendif-labels -Wimplicit-fallthrough=2 -Winit-self -Wlogical-op -Wmissing-include-dirs -Wno-missing-braces -Wno-missing-field-initializers -Wno-unused-parameter -Wold-style-definition -Woverflow -Wstrict-aliasing=2 -Wstrict-prototypes -Wundef -Wvla -fstrict-aliasing -std=c99 -DMUON_BOOTSTRAPPED -O2 -pipe -DMUON_PLATFORM_posix -DMUON_ENDIAN=0 -MD -MQ muon.p/src_lang_analyze.c.o -MF muon.p/src_lang_analyze.c.o.d -o muon.p/src_lang_analyze.c.o -c ../muon-v0.4.0/src/lang/analyze.c >[124/131] riscv64-unknown-linux-gnu-gcc -Imuon.p -I. -I../muon-v0.4.0 -I../muon-v0.4.0/include -Isubprojects/tinyjson -I../muon-v0.4.0/subprojects/tinyjson -Isubprojects/bestline -I../muon-v0.4.0/subprojects/bestline -Isrc/script -I/usr/include/pkgconf -fdiagnostics-color=always -D_FILE_OFFSET_BITS=64 -Wall -Winvalid-pch -Wextra -Wpedantic -Wendif-labels -Wimplicit-fallthrough=2 -Winit-self -Wlogical-op -Wmissing-include-dirs -Wno-missing-braces -Wno-missing-field-initializers -Wno-unused-parameter -Wold-style-definition -Woverflow -Wstrict-aliasing=2 -Wstrict-prototypes -Wundef -Wvla -fstrict-aliasing -std=c99 -DMUON_BOOTSTRAPPED -O2 -pipe -DMUON_PLATFORM_posix -DMUON_ENDIAN=0 -MD -MQ muon.p/src_options.c.o -MF muon.p/src_options.c.o.d -o muon.p/src_options.c.o -c ../muon-v0.4.0/src/options.c >[125/131] riscv64-unknown-linux-gnu-gcc -Imuon.p -I. -I../muon-v0.4.0 -I../muon-v0.4.0/include -Isubprojects/tinyjson -I../muon-v0.4.0/subprojects/tinyjson -Isubprojects/bestline -I../muon-v0.4.0/subprojects/bestline -Isrc/script -I/usr/include/pkgconf -fdiagnostics-color=always -D_FILE_OFFSET_BITS=64 -Wall -Winvalid-pch -Wextra -Wpedantic -Wendif-labels -Wimplicit-fallthrough=2 -Winit-self -Wlogical-op -Wmissing-include-dirs -Wno-missing-braces -Wno-missing-field-initializers -Wno-unused-parameter -Wold-style-definition -Woverflow -Wstrict-aliasing=2 -Wstrict-prototypes -Wundef -Wvla -fstrict-aliasing -std=c99 -DMUON_BOOTSTRAPPED -O2 -pipe -DMUON_PLATFORM_posix -DMUON_ENDIAN=0 -MD -MQ muon.p/src_main.c.o -MF muon.p/src_main.c.o.d -o muon.p/src_main.c.o -c ../muon-v0.4.0/src/main.c >[126/131] riscv64-unknown-linux-gnu-gcc -Isubprojects/bestline/libbestline.a.p -Isubprojects/bestline -I../muon-v0.4.0/subprojects/bestline -fdiagnostics-color=always -D_FILE_OFFSET_BITS=64 -Wall -Winvalid-pch -Wextra -Wpedantic -O2 -pipe -fPIC -MD -MQ subprojects/bestline/libbestline.a.p/bestline.c.o -MF subprojects/bestline/libbestline.a.p/bestline.c.o.d -o subprojects/bestline/libbestline.a.p/bestline.c.o -c ../muon-v0.4.0/subprojects/bestline/bestline.c >[01m[K../muon-v0.4.0/subprojects/bestline/bestline.c:[m[K In function â[01m[KGetLineChar[m[Kâ: >[01m[K../muon-v0.4.0/subprojects/bestline/bestline.c:1612:17:[m[K [01;35m[Kwarning: [m[Kignoring return value of â[01m[Kwrite[m[Kâ declared with attribute â[01m[Kwarn_unused_result[m[Kâ [[01;35m[K-Wunused-result[m[K] > 1612 | [01;35m[Kwrite(fout, "\n", 1)[m[K; > | [01;35m[K^~~~~~~~~~~~~~~~~~~~[m[K >[127/131] rm -f subprojects/bestline/libbestline.a && riscv64-unknown-linux-gnu-ar csrDT subprojects/bestline/libbestline.a subprojects/bestline/libbestline.a.p/bestline.c.o >[128/131] riscv64-unknown-linux-gnu-gcc -Imuon.p -I. -I../muon-v0.4.0 -I../muon-v0.4.0/include -Isubprojects/tinyjson -I../muon-v0.4.0/subprojects/tinyjson -Isubprojects/bestline -I../muon-v0.4.0/subprojects/bestline -Isrc/script -I/usr/include/pkgconf -fdiagnostics-color=always -D_FILE_OFFSET_BITS=64 -Wall -Winvalid-pch -Wextra -Wpedantic -Wendif-labels -Wimplicit-fallthrough=2 -Winit-self -Wlogical-op -Wmissing-include-dirs -Wno-missing-braces -Wno-missing-field-initializers -Wno-unused-parameter -Wold-style-definition -Woverflow -Wstrict-aliasing=2 -Wstrict-prototypes -Wundef -Wvla -fstrict-aliasing -std=c99 -DMUON_BOOTSTRAPPED -O2 -pipe -DMUON_PLATFORM_posix -DMUON_ENDIAN=0 -MD -MQ muon.p/src_lang_object.c.o -MF muon.p/src_lang_object.c.o.d -o muon.p/src_lang_object.c.o -c ../muon-v0.4.0/src/lang/object.c >[129/131] riscv64-unknown-linux-gnu-gcc -Imuon.p -I. -I../muon-v0.4.0 -I../muon-v0.4.0/include -Isubprojects/tinyjson -I../muon-v0.4.0/subprojects/tinyjson -Isubprojects/bestline -I../muon-v0.4.0/subprojects/bestline -Isrc/script -I/usr/include/pkgconf -fdiagnostics-color=always -D_FILE_OFFSET_BITS=64 -Wall -Winvalid-pch -Wextra -Wpedantic -Wendif-labels -Wimplicit-fallthrough=2 -Winit-self -Wlogical-op -Wmissing-include-dirs -Wno-missing-braces -Wno-missing-field-initializers -Wno-unused-parameter -Wold-style-definition -Woverflow -Wstrict-aliasing=2 -Wstrict-prototypes -Wundef -Wvla -fstrict-aliasing -std=c99 -DMUON_BOOTSTRAPPED -O2 -pipe -DMUON_PLATFORM_posix -DMUON_ENDIAN=0 -MD -MQ muon.p/src_lang_vm.c.o -MF muon.p/src_lang_vm.c.o.d -o muon.p/src_lang_vm.c.o -c ../muon-v0.4.0/src/lang/vm.c >[130/131] riscv64-unknown-linux-gnu-gcc -Imuon.p -I. -I../muon-v0.4.0 -I../muon-v0.4.0/include -Isubprojects/tinyjson -I../muon-v0.4.0/subprojects/tinyjson -Isubprojects/bestline -I../muon-v0.4.0/subprojects/bestline -Isrc/script -I/usr/include/pkgconf -fdiagnostics-color=always -D_FILE_OFFSET_BITS=64 -Wall -Winvalid-pch -Wextra -Wpedantic -Wendif-labels -Wimplicit-fallthrough=2 -Winit-self -Wlogical-op -Wmissing-include-dirs -Wno-missing-braces -Wno-missing-field-initializers -Wno-unused-parameter -Wold-style-definition -Woverflow -Wstrict-aliasing=2 -Wstrict-prototypes -Wundef -Wvla -fstrict-aliasing -std=c99 -DMUON_BOOTSTRAPPED -O2 -pipe -DMUON_PLATFORM_posix -DMUON_ENDIAN=0 -MD -MQ muon.p/src_compilers.c.o -MF muon.p/src_compilers.c.o.d -o muon.p/src_compilers.c.o -c ../muon-v0.4.0/src/compilers.c >[131/131] riscv64-unknown-linux-gnu-gcc -o muon muon.p/src_backend_backend.c.o muon.p/src_backend_common_args.c.o muon.p/src_backend_introspect.c.o muon.p/src_backend_ninja.c.o muon.p/src_backend_ninja_alias_target.c.o muon.p/src_backend_ninja_build_target.c.o muon.p/src_backend_ninja_coverage.c.o muon.p/src_backend_ninja_custom_target.c.o muon.p/src_backend_ninja_rules.c.o muon.p/src_backend_output.c.o muon.p/src_backend_xcode.c.o muon.p/src_datastructures_arr.c.o muon.p/src_datastructures_bucket_arr.c.o muon.p/src_datastructures_hash.c.o muon.p/src_datastructures_stack.c.o muon.p/src_formats_editorconfig.c.o muon.p/src_formats_ini.c.o muon.p/src_formats_lines.c.o muon.p/src_formats_tap.c.o muon.p/src_formats_xml.c.o muon.p/src_functions_array.c.o muon.p/src_functions_boolean.c.o muon.p/src_functions_both_libs.c.o muon.p/src_functions_build_target.c.o muon.p/src_functions_compiler.c.o muon.p/src_functions_configuration_data.c.o muon.p/src_functions_custom_target.c.o muon.p/src_functions_dependency.c.o muon.p/src_functions_dict.c.o muon.p/src_functions_disabler.c.o muon.p/src_functions_environment.c.o muon.p/src_functions_external_program.c.o muon.p/src_functions_feature_opt.c.o muon.p/src_functions_file.c.o muon.p/src_functions_generator.c.o muon.p/src_functions_kernel.c.o muon.p/src_functions_kernel_build_target.c.o muon.p/src_functions_kernel_configure_file.c.o muon.p/src_functions_kernel_custom_target.c.o muon.p/src_functions_kernel_dependency.c.o muon.p/src_functions_kernel_install.c.o muon.p/src_functions_kernel_options.c.o muon.p/src_functions_kernel_subproject.c.o muon.p/src_functions_machine.c.o muon.p/src_functions_meson.c.o muon.p/src_functions_modules.c.o muon.p/src_functions_modules_fs.c.o muon.p/src_functions_modules_getopt.c.o muon.p/src_functions_modules_keyval.c.o muon.p/src_functions_modules_pkgconfig.c.o muon.p/src_functions_modules_python.c.o muon.p/src_functions_modules_sourceset.c.o muon.p/src_functions_modules_subprojects.c.o muon.p/src_functions_modules_toolchain.c.o muon.p/src_functions_number.c.o muon.p/src_functions_run_result.c.o muon.p/src_functions_source_configuration.c.o muon.p/src_functions_source_set.c.o muon.p/src_functions_string.c.o muon.p/src_functions_subproject.c.o muon.p/src_lang_analyze.c.o muon.p/src_lang_compiler.c.o muon.p/src_lang_eval.c.o muon.p/src_lang_fmt.c.o muon.p/src_lang_func_lookup.c.o muon.p/src_lang_lexer.c.o muon.p/src_lang_object.c.o muon.p/src_lang_object_iterators.c.o muon.p/src_lang_parser.c.o muon.p/src_lang_serial.c.o muon.p/src_lang_string.c.o muon.p/src_lang_typecheck.c.o muon.p/src_lang_vm.c.o muon.p/src_lang_workspace.c.o muon.p/src_args.c.o muon.p/src_cmd_install.c.o muon.p/src_cmd_subprojects.c.o muon.p/src_cmd_test.c.o muon.p/src_coerce.c.o muon.p/src_compilers.c.o muon.p/src_embedded.c.o muon.p/src_error.c.o muon.p/src_guess.c.o muon.p/src_install.c.o muon.p/src_log.c.o muon.p/src_machine_file.c.o muon.p/src_machines.c.o muon.p/src_main.c.o muon.p/src_memmem.c.o muon.p/src_meson_opts.c.o muon.p/src_options.c.o muon.p/src_opts.c.o muon.p/src_rpmvercmp.c.o muon.p/src_sha_256.c.o muon.p/src_vsenv.c.o muon.p/src_wrap.c.o muon.p/src_platform_assert.c.o muon.p/src_platform_filesystem.c.o muon.p/src_platform_mem.c.o muon.p/src_platform_os.c.o muon.p/src_platform_path.c.o muon.p/src_platform_run_cmd.c.o muon.p/src_platform_uname.c.o muon.p/src_platform_posix_filesystem.c.o muon.p/src_platform_posix_init.c.o muon.p/src_platform_posix_log.c.o muon.p/src_platform_posix_os.c.o muon.p/src_platform_posix_path.c.o muon.p/src_platform_posix_run_cmd.c.o muon.p/src_platform_posix_term.c.o muon.p/src_platform_posix_timer.c.o muon.p/src_platform_posix_uname.c.o muon.p/src_platform_posix_rpath_fixer.c.o muon.p/meson-generated_.._src_version.c.o muon.p/src_external_libcurl.c.o muon.p/src_external_libarchive.c.o muon.p/src_external_libpkgconf.c.o muon.p/src_external_tinyjson.c.o muon.p/src_external_samurai_null.c.o muon.p/src_external_readline_bestline.c.o muon.p/src_ui_null.c.o -Wl,--as-needed -Wl,--no-undefined -O2 -pipe -Wl,-O1 -Wl,--as-needed -Wl,--start-group subprojects/tinyjson/libtiny-json.a subprojects/bestline/libbestline.a /usr/lib64/libcurl.so /usr/lib64/libarchive.so /usr/lib64/libpkgconf.so -Wl,--end-group >>>> Source compiled. >>>> Test phase: dev-build/muon-0.4.0 >meson test --print-errorlogs --num-processes 32 >ninja: Entering directory `/var/tmp/portage/dev-build/muon-0.4.0/work/muon-0.4.0-build' >ninja: no work to do. >[1-32/350] ð muon:lang / katie.meson 0/30s[K 1/350 muon:fmt / case/space_array [1;32mOK [0m 0.68s > 2/350 muon:fmt / case/kwargs_force_multiline [1;32mOK [0m 0.66s > 3/350 muon:fmt / case/wide_colon [1;32mOK [0m 0.65s > 4/350 muon:fmt / case/no_single_comma_function [1;32mOK [0m 0.64s > 5/350 muon:fmt / case/indent_before_comments [1;32mOK [0m 0.62s > 6/350 muon:fmt / case/insert_final_newline_false [1;32mOK [0m 0.61s > 7/350 muon:fmt / case/insert_final_newline_true [1;32mOK [0m 0.60s > 8/350 muon:fmt / case/sort_files [1;32mOK [0m 0.58s > 9/350 muon:fmt / case/group_arg_value [1;32mOK [0m 0.57s > 10/350 muon:fmt / case/simplify_string_literals [1;32mOK [0m 0.55s > 11/350 muon:fmt / case/end_of_line_lf_to_crlf [1;32mOK [0m 0.54s > 12/350 muon:fmt / case/end_of_line_crlf_to_lf [1;32mOK [0m 0.53s > 13/350 muon:fmt / case/end_of_line_auto_crlf [1;32mOK [0m 0.51s > 14/350 muon:fmt / case/end_of_line_auto_lf [1;32mOK [0m 0.50s > 15/350 muon:fmt / case/sticky_parens [1;32mOK [0m 0.48s > 16/350 muon:fmt / case/continuation_indent [1;32mOK [0m 0.47s > 17/350 muon:lang / array.meson [1;32mOK [0m 0.46s > 18/350 muon:lang / badnum.meson [1;33mEXPECTEDFAIL [0m 0.45s exit status 1 > 19/350 muon:lang / configuration_data.meson [1;32mOK [0m 0.43s > 20/350 muon:lang / dict.meson [1;32mOK [0m 0.42s > 21/350 muon:lang / disabler.meson [1;32mOK [0m 0.32s > 22/350 muon:lang / environment.meson [1;32mOK [0m 0.30s > 23/350 muon:lang / fstring.meson [1;32mOK [0m 0.29s > 24/350 muon:lang / func.meson [1;32mOK [0m 0.28s > 25/350 muon:lang / join.meson [1;32mOK [0m 0.26s > 26/350 muon:lang / join_paths.meson [1;32mOK [0m 0.25s > 27/350 muon:lang / katie.meson [1;32mOK [0m 0.23s >[28-32/350] ð muon:fmt / editorconfig root/sub 0/30s[K 28/350 muon:fmt / editorconfig basic [1;32mOK [0m 1.48s > 29/350 muon:fmt / editorconfig no-match [1;32mOK [0m 1.46s > 30/350 muon:fmt / editorconfig esc[pe [1;32mOK [0m 1.45s > 31/350 muon:fmt / editorconfig root/sub [1;32mOK [0m 1.44s >[32-59/350] ð muon:project+meson-tests / meson-tests/common/10 man install 0/30s[K[32-63/350] ð muon:project+meson-tests / meson-tests/common/10 man install 0/30s[K 32/350 muon:lang / line_continuation.meson [1;32mOK [0m 0.73s > 33/350 muon:lang / multiline.meson [1;32mOK [0m 0.71s > 34/350 muon:lang / object_stack_page_size.meson [1;32mOK [0m 0.70s > 35/350 muon:lang / range.meson [1;32mOK [0m 0.69s > 36/350 muon:lang / return_during_iteration.meson [1;32mOK [0m 0.68s > 37/350 muon:lang / run_command.meson [1;32mOK [0m 0.66s > 38/350 muon:lang / string_format_escape.meson [1;32mOK [0m 0.65s > 39/350 muon:lang / strings.meson [1;32mOK [0m 0.64s > 40/350 muon:lang / ternary.meson [1;32mOK [0m 0.63s > 41/350 muon:lang / unicode.meson [1;32mOK [0m 0.62s > 42/350 muon:lang / version_compare.meson [1;32mOK [0m 0.60s > 43/350 muon:project+muon / muon/sizeof_invalid [1;32mOK [0m 0.57s > 44/350 muon:project+muon / muon/str [1;32mOK [0m 0.56s > 45/350 muon:project+muon / muon/script_module [1;32mOK [0m 0.53s >[46-63/350] ð muon:project+meson-tests / meson-tests/common/10 man install 0/30s[K[46-77/350] ð muon:project+meson-tests / meson-tests/common/10 man install 0/30s[K 46/350 muon:project+meson-tests / meson-tests/common/9 header install [1;32mOK [0m 0.70s > 47/350 muon:project+meson-tests / meson-tests/common/10 man install [1;32mOK [0m 0.69s > 48/350 muon:project+unit+requires_python / unit/65 alias target [1;32mOK [0m 0.91s >[49-77/350] ð muon:project+meson-tests / meson-tests/common/28 try compile 0/30s[K 49/350 muon:project+meson-tests / meson-tests/common/12 data [1;32mOK [0m 0.73s > 50/350 muon:project+meson-tests / meson-tests/common/3 static [1;32mOK [0m 0.97s > 51/350 muon:project+meson-tests / meson-tests/common/4 shared [1;32mOK [0m 0.96s > 52/350 muon:project+meson-tests / meson-tests/common/1 trivial [1;32mOK [0m 1.04s > 53/350 muon:project+meson-tests+requires_python / meson-tests/common/8 install [1;32mOK [0m 0.90s > 54/350 muon:project+meson-tests / meson-tests/common/5 linkstatic [1;32mOK [0m 0.97s >[55-80/350] ð muon:project+meson-tests / meson-tests/common/28 try compile 0/30s[K[55-86/350] ð muon:project+meson-tests / meson-tests/common/37 has member 0/30s[K[55-86/350] ð muon:project+meson-tests / meson-tests/common/37 has member 0/30s[K 55/350 muon:project+meson-tests / meson-tests/common/7 mixed [1;32mOK [0m 1.17s >[56-86/350] ð muon:project+meson-tests / meson-tests/common/37 has member 0/30s[K 56/350 muon:project+meson-tests / meson-tests/common/11 subdir [1;32mOK [0m 1.10s >[57-87/350] ð muon:project+meson-tests / meson-tests/common/37 has member 0/30s[K 57/350 muon:project+meson-tests / meson-tests/common/6 linkshared [1;32mOK [0m 1.29s >[58-88/350] ð muon:project+meson-tests / meson-tests/common/37 has member 0/30s[K[58-89/350] ð muon:project+meson-tests / meson-tests/common/37 has member 0/30s[K 58/350 muon:project+meson-tests / meson-tests/common/15 if [1;32mOK [0m 0.95s >[59-89/350] ð muon:project+meson-tests / meson-tests/common/37 has member 0/30s[K 59/350 muon:fmt / test_all_meson_files [1;32mOK [0m 2.77s > 60/350 muon:project+meson-tests / meson-tests/common/17 array [1;32mOK [0m 0.95s >[61-90/350] ð muon:project+meson-tests / meson-tests/common/37 has member 0/30s[K 61/350 muon:project+meson-tests / meson-tests/common/18 includedir [1;32mOK [0m 0.99s > 62/350 muon:project+meson-tests / meson-tests/common/29 compiler id [1;32mOK [0m 0.67s >[63-92/350] ð muon:project+meson-tests / meson-tests/common/37 has member 0/30s[K 63/350 muon:project+meson-tests / meson-tests/common/34 logic ops [1;32mOK [0m 0.50s >[64-94/350] ð muon:project+meson-tests / meson-tests/common/37 has member 0/30s[K[64-95/350] ð muon:project+meson-tests / meson-tests/common/37 has member 0/30s[K 64/350 muon:project+meson-tests / meson-tests/common/24 library versions [1;32mOK [0m 0.98s >[65-95/350] ð muon:project+meson-tests / meson-tests/common/37 has member 0/30s[K 65/350 muon:project+meson-tests / meson-tests/common/35 string operations [1;32mOK [0m 0.55s > 66/350 muon:project+meson-tests / meson-tests/common/16 comparison [1;32mOK [0m 1.21s > 67/350 muon:project+meson-tests / meson-tests/common/27 multiline string [1;32mOK [0m 0.96s > 68/350 muon:project+meson-tests / meson-tests/common/19 header in file list [1;32mOK [0m 1.17s >[69-96/350] ð muon:project+meson-tests / meson-tests/common/37 has member 0/30s[K 69/350 muon:project+meson-tests / meson-tests/common/23 endian [1;32mOK [0m 1.19s > 70/350 muon:project+muon+requires_python / muon/python [1;32mOK [0m 1.95s > 71/350 muon:project+meson-tests / meson-tests/common/20 global arg [1;32mOK [0m 1.28s > 72/350 muon:project+meson-tests / meson-tests/common/25 config subdir [1;32mOK [0m 1.17s >[73-100/350] ð muon:project+meson-tests / meson-tests/common/37 has member 0/30s[K 73/350 muon:project+meson-tests / meson-tests/common/21 target arg [1;32mOK [0m 1.41s >[74-104/350] ð muon:project+meson-tests / meson-tests/common/37 has member 0/30s[K[74-105/350] ð muon:project+meson-tests / meson-tests/common/37 has member 0/30s[K 74/350 muon:project+meson-tests+requires_python / meson-tests/common/22 object extraction [1;32mOK [0m 1.45s > 75/350 muon:project+meson-tests / meson-tests/common/40 options [1;32mOK [0m 0.72s > 76/350 muon:project+meson-tests / meson-tests/common/43 subproject options [1;32mOK [0m 0.60s >[77-105/350] ð muon:project+meson-tests / meson-tests/common/37 has member 0/30s[K 77/350 muon:project+meson-tests / meson-tests/common/31 define10 [1;32mOK [0m 1.31s >[78-108/350] ð muon:project+meson-tests / meson-tests/common/59 install subdir 0/30s[K 78/350 muon:project+meson-tests+requires_python / meson-tests/common/33 run program [1;32mOK [0m 1.23s >[79-109/350] ð muon:project+meson-tests / meson-tests/common/59 install subdir 0/30s[K[79-110/350] ð muon:project+meson-tests / meson-tests/common/59 install subdir 0/30s[K 79/350 muon:project+meson-tests+requires_python / meson-tests/common/49 custom target [1;32mOK [0m 0.59s >[80-110/350] ð muon:project+meson-tests / meson-tests/common/59 install subdir 0/30s[K 80/350 muon:project+muon / muon/timeout [1;33mEXPECTEDFAIL [0m 2.55s exit status 1 >[81-111/350] ð muon:project+meson-tests / meson-tests/common/59 install subdir 0/30s[K 81/350 muon:project+meson-tests+requires_python / meson-tests/common/26 find program [1;32mOK [0m 1.72s > 82/350 muon:project+meson-tests / meson-tests/common/56 array methods [1;32mOK [0m 0.42s >[83-112/350] ð muon:project+meson-tests / meson-tests/common/59 install subdir 0/30s[K 83/350 muon:project+meson-tests / meson-tests/common/45 custom install dirs [1;32mOK [0m 0.95s >[84-114/350] ð muon:project+meson-tests / meson-tests/common/59 install subdir 0/30s[K[84-115/350] ð muon:project+meson-tests / meson-tests/common/59 install subdir 0/30s[K 84/350 muon:project+meson-tests / meson-tests/common/39 library chain [1;32mOK [0m 1.25s >[85-115/350] ð muon:project+meson-tests / meson-tests/common/59 install subdir 0/30s[K[85-116/350] ð muon:project+meson-tests / meson-tests/common/59 install subdir 0/30s[K 85/350 muon:project+meson-tests / meson-tests/common/42 subproject [1;32mOK [0m 1.15s >[86-116/350] ð muon:project+meson-tests / meson-tests/common/59 install subdir 0/30s[K 86/350 muon:project+meson-tests / meson-tests/common/47 same file name [1;32mOK [0m 1.00s > 87/350 muon:project+meson-tests / meson-tests/common/59 install subdir [1;32mOK [0m 0.47s >[88-117/350] ð muon:project+meson-tests / meson-tests/common/68 should fail 0/30s[K[88-119/350] ð muon:project+meson-tests / meson-tests/common/68 should fail 0/30s[K 88/350 muon:project+meson-tests+requires_python / meson-tests/common/41 test args [1;32mOK [0m 1.33s > 89/350 muon:project+meson-tests / meson-tests/common/61 number arithmetic [1;32mOK [0m 0.45s > 90/350 muon:project+meson-tests / meson-tests/common/48 file grabber [1;32mOK [0m 1.04s >[91-119/350] ð muon:project+meson-tests / meson-tests/common/68 should fail 0/30s[K[91-122/350] ð muon:project+meson-tests / meson-tests/common/68 should fail 0/30s[K 91/350 muon:project+meson-tests / meson-tests/common/62 string arithmetic [1;32mOK [0m 0.50s > 92/350 muon:project+meson-tests+requires_python / meson-tests/common/50 custom target chain [1;32mOK [0m 1.10s > 93/350 muon:project+meson-tests / meson-tests/common/63 array arithmetic [1;32mOK [0m 0.48s >[94-122/350] ð muon:project+meson-tests / meson-tests/common/68 should fail 0/30s[K 94/350 muon:project+meson-tests / meson-tests/common/64 arithmetic bidmas [1;32mOK [0m 0.54s >[95-125/350] ð muon:project+meson-tests / meson-tests/common/68 should fail 0/30s[K[95-126/350] ð muon:project+meson-tests / meson-tests/common/68 should fail 0/30s[K 95/350 muon:project+meson-tests / meson-tests/common/46 subproject subproject [1;32mOK [0m 1.44s >[96-126/350] ð muon:project+meson-tests / meson-tests/common/68 should fail 0/30s[K 96/350 muon:project+meson-tests+requires_python / meson-tests/common/44 pkgconfig-gen [1;32mOK [0m 1.55s > 97/350 muon:project+meson-tests / meson-tests/common/67 modules [1;32mOK [0m 0.52s >[98-127/350] ð muon:project+meson-tests / meson-tests/common/68 should fail 0/30s[K[98-129/350] ð muon:project+meson-tests / meson-tests/common/68 should fail 0/30s[K 98/350 muon:project+meson-tests+requires_python / meson-tests/common/54 custom target source output [1;32mOK [0m 1.23s > 99/350 muon:project+meson-tests+requires_python / meson-tests/common/69 configure file in custom target [1;32mOK [0m 0.50s >100/350 muon:project+meson-tests / meson-tests/common/55 exe static shared [1;32mOK [0m 1.21s >101/350 muon:project+meson-tests+requires_python / meson-tests/common/52 object generator [1;32mOK [0m 1.33s >[102-129/350] ð muon:project+meson-tests / meson-tests/common/68 should fail 0/30s[K[102-133/350] ð muon:project+meson-tests / meson-tests/common/84 plusassign 0/30s[K102/350 muon:project+meson-tests+requires_python / meson-tests/common/71 ctarget dependency [1;32mOK [0m 0.58s >[103-133/350] ð muon:project+meson-tests / meson-tests/common/84 plusassign 0/30s[K[103-134/350] ð muon:project+meson-tests / meson-tests/common/84 plusassign 0/30s[K103/350 muon:project+meson-tests+requires_python / meson-tests/common/70 external test program [1;32mOK [0m 0.70s >[104-134/350] ð muon:project+meson-tests / meson-tests/common/84 plusassign 0/30s[K104/350 muon:project+meson-tests+requires_python / meson-tests/common/57 custom header generator [1;32mOK [0m 1.36s >105/350 muon:project+meson-tests / meson-tests/common/60 foreach [1;32mOK [0m 1.24s >[106-135/350] ð muon:project+meson-tests / meson-tests/common/84 plusassign 0/30s[K[106-137/350] ð muon:project+meson-tests / meson-tests/common/84 plusassign 0/30s[K106/350 muon:project+meson-tests+requires_python / meson-tests/common/58 multiple generators [1;32mOK [0m 1.44s >[107-137/350] ð muon:project+meson-tests / meson-tests/common/84 plusassign 0/30s[K[107-138/350] ð muon:project+meson-tests / meson-tests/common/84 plusassign 0/30s[K107/350 muon:project+meson-tests / meson-tests/common/37 has member [1;32mOK [0m 2.46s >[108-138/350] ð muon:project+meson-tests / meson-tests/common/84 plusassign 0/30s[K[108-139/350] ð muon:project+meson-tests / meson-tests/common/84 plusassign 0/30s[K108/350 muon:project+meson-tests / meson-tests/common/68 should fail [1;32mOK [0m 1.07s >[109-139/350] ð muon:project+meson-tests / meson-tests/common/84 plusassign 0/30s[K109/350 muon:project+meson-tests+requires_python / meson-tests/common/65 build always [1;32mOK [0m 1.25s >[110-140/350] ð muon:project+meson-tests / meson-tests/common/84 plusassign 0/30s[K[110-141/350] ð muon:project+meson-tests / meson-tests/common/84 plusassign 0/30s[K110/350 muon:project+meson-tests / meson-tests/common/84 plusassign [1;32mOK [0m 0.47s >[111-141/350] ð muon:project+meson-tests+requires_python / meson-tests/common/92 test workdir 0/30s[K[111-142/350] ð muon:project+meson-tests+requires_python / meson-tests/common/92 test workdir 0/30s[K111/350 muon:project+meson-tests / meson-tests/common/85 skip subdir [1;32mOK [0m 0.47s >[112-142/350] ð muon:project+meson-tests+requires_python / meson-tests/common/92 test workdir 0/30s[K[112-143/350] ð muon:project+meson-tests+requires_python / meson-tests/common/92 test workdir 0/30s[K112/350 muon:project+meson-tests+requires_python / meson-tests/common/66 vcstag [1;32mOK [0m 1.35s >113/350 muon:project+meson-tests / meson-tests/common/77 extract from nested subdir [1;32mOK [0m 0.88s >[114-143/350] ð muon:project+meson-tests+requires_python / meson-tests/common/92 test workdir 0/30s[K114/350 muon:project+meson-tests / meson-tests/common/73 shared subproject 2 [1;32mOK [0m 1.14s >[115-145/350] ð muon:project+meson-tests+requires_python / meson-tests/common/92 test workdir 0/30s[K[115-146/350] ð muon:project+meson-tests+requires_python / meson-tests/common/92 test workdir 0/30s[K115/350 muon:project+meson-tests / meson-tests/common/72 shared subproject [1;32mOK [0m 1.22s >[116-146/350] ð muon:project+meson-tests+requires_python / meson-tests/common/92 test workdir 0/30s[K116/350 muon:project+meson-tests / meson-tests/common/74 file object [1;32mOK [0m 1.16s >[117-147/350] ð muon:project+meson-tests+requires_python / meson-tests/common/92 test workdir 0/30s[K117/350 muon:project+meson-tests / meson-tests/common/87 default options [1;32mOK [0m 0.61s >[118-148/350] ð muon:project+meson-tests+requires_python / meson-tests/common/92 test workdir 0/30s[K[118-149/350] ð muon:project+meson-tests+requires_python / meson-tests/common/92 test workdir 0/30s[K118/350 muon:project+meson-tests / meson-tests/common/80 declare dep [1;32mOK [0m 1.03s >[119-149/350] ð muon:project+meson-tests+requires_python / meson-tests/common/92 test workdir 0/30s[K119/350 muon:project+meson-tests / meson-tests/common/75 custom subproject dir [1;32mOK [0m 1.28s >120/350 muon:project+meson-tests / meson-tests/common/79 same basename [1;32mOK [0m 1.11s >[121-150/350] ð muon:project+meson-tests+requires_python / meson-tests/common/92 test workdir 0/30s[K121/350 muon:project+meson-tests / meson-tests/common/78 internal dependency [1;32mOK [0m 1.24s >[122-152/350] ð muon:project+meson-tests+requires_python / meson-tests/common/92 test workdir 0/30s[K[122-153/350] ð muon:project+meson-tests / meson-tests/common/104 has arg 0/30s[K[122-153/350] ð muon:project+meson-tests / meson-tests/common/104 has arg 0/30s[K122/350 muon:project+meson-tests / meson-tests/common/81 extract all [1;32mOK [0m 1.15s >123/350 muon:project+meson-tests+requires_python / meson-tests/common/83 identical target name in subproject [1;32mOK [0m 1.09s >[124-153/350] ð muon:project+meson-tests / meson-tests/common/104 has arg 0/30s[K[124-155/350] ð muon:project+meson-tests / meson-tests/common/104 has arg 0/30s[K124/350 muon:project+meson-tests / meson-tests/common/76 has type [1;32mOK [0m 1.48s >[125-155/350] ð muon:project+meson-tests / meson-tests/common/104 has arg 0/30s[K[125-156/350] ð muon:project+meson-tests / meson-tests/common/104 has arg 0/30s[K125/350 muon:project+meson-tests / meson-tests/common/30 sizeof [1;32mOK [0m 3.61s >[126-156/350] ð muon:project+meson-tests / meson-tests/common/104 has arg 0/30s[K126/350 muon:project+meson-tests / meson-tests/common/32 has header [1;32mOK [0m 3.52s >[127-157/350] ð muon:project+meson-tests / meson-tests/common/104 has arg 0/30s[K[127-158/350] ð muon:project+meson-tests / meson-tests/common/104 has arg 0/30s[K127/350 muon:project+meson-tests+requires_python / meson-tests/common/51 run target [1;32mOK [0m 2.80s >[128-158/350] ð muon:project+meson-tests / meson-tests/common/104 has arg 0/30s[K128/350 muon:project+meson-tests / meson-tests/common/91 benchmark [1;32mOK [0m 0.93s >129/350 muon:project+meson-tests / meson-tests/common/101 testframework options [1;32mOK [0m 0.48s >[130-159/350] ð muon:project+meson-tests / meson-tests/common/104 has arg 0/30s[K[130-161/350] ð muon:project+meson-tests / meson-tests/common/104 has arg 0/30s[K130/350 muon:project+meson-tests / meson-tests/common/2 cpp [1;32mOK [0m 4.76s >131/350 muon:project+meson-tests+requires_python / meson-tests/common/86 private include [1;32mOK [0m 1.31s >[132-161/350] ð muon:project+meson-tests / meson-tests/common/104 has arg 0/30s[K132/350 muon:project+meson-tests / meson-tests/common/38 alignment [1;32mOK [0m 3.55s >[133-163/350] ð muon:project+meson-tests / meson-tests/common/104 has arg 0/30s[K[133-164/350] ð muon:project+meson-tests / meson-tests/common/104 has arg 0/30s[K133/350 muon:project+meson-tests / meson-tests/common/93 suites [1;32mOK [0m 1.07s >134/350 muon:project+meson-tests / meson-tests/common/108 ternary [1;32mOK [0m 0.37s >135/350 muon:project+meson-tests+requires_python / meson-tests/common/106 multiple dir configure file [1;32mOK [0m 0.48s >[136-164/350] ð muon:project+meson-tests / meson-tests/common/104 has arg 0/30s[K136/350 muon:project+meson-tests+requires_python / meson-tests/common/92 test workdir [1;32mOK [0m 1.23s >[137-167/350] ð muon:project+meson-tests / meson-tests/common/104 has arg 0/30s[K[137-168/350] ð muon:project+meson-tests / meson-tests/common/104 has arg 0/30s[K137/350 muon:project+meson-tests+requires_python / meson-tests/common/90 gen extra [1;32mOK [0m 1.37s >[138-168/350] ð muon:project+meson-tests / meson-tests/common/104 has arg 0/30s[K138/350 muon:project+meson-tests / meson-tests/common/114 skip [1;33mSKIP [0m 0.30s exit status 77 >139/350 muon:project+meson-tests / meson-tests/common/96 stringdef [1;32mOK [0m 1.16s >140/350 muon:project+meson-tests / meson-tests/common/111 pathjoin [1;32mOK [0m 0.43s >[141-169/350] ð muon:project+meson-tests / meson-tests/common/104 has arg 0/30s[K141/350 muon:project+meson-tests+requires_python / meson-tests/common/53 install script [1;32mOK [0m 3.30s >142/350 muon:project+meson-tests / meson-tests/common/113 interpreter copy mutable var on assignment [1;32mOK [0m 0.46s >[143-172/350] ð muon:project+meson-tests / meson-tests/common/104 has arg 0/30s[K[143-174/350] ð muon:project+meson-tests / meson-tests/common/104 has arg 0/30s[K143/350 muon:project+meson-tests+requires_python / meson-tests/common/99 postconf [1;32mOK [0m 1.22s >[144-174/350] ð muon:project+meson-tests / meson-tests/common/104 has arg 0/30s[K[144-175/350] ð muon:project+meson-tests+requires_python / meson-tests/common/126 generated llvm ir 0/30s[K144/350 muon:project+meson-tests / meson-tests/common/102 extract same name [1;32mOK [0m 1.13s >145/350 muon:project+meson-tests+requires_python / meson-tests/common/100 postconf with args [1;32mOK [0m 1.24s >[146-175/350] ð muon:project+meson-tests+requires_python / meson-tests/common/126 generated llvm ir 0/30s[K146/350 muon:project+meson-tests+requires_python / meson-tests/common/109 custom target capture [1;32mOK [0m 0.89s >[147-177/350] ð muon:project+meson-tests+requires_python / meson-tests/common/126 generated llvm ir 0/30s[K147/350 muon:project+meson-tests / meson-tests/common/119 cpp and asm [1;33mSKIP [0m 0.50s exit status 77 >[148-178/350] ð muon:project+meson-tests+requires_python / meson-tests/common/126 generated llvm ir 0/30s[K[148-179/350] ð muon:project+meson-tests+requires_python / meson-tests/common/126 generated llvm ir 0/30s[K148/350 muon:project+meson-tests+requires_python / meson-tests/common/88 dep fallback [1;32mOK [0m 2.00s >[149-179/350] ð muon:project+meson-tests+requires_python / meson-tests/common/126 generated llvm ir 0/30s[K149/350 muon:project+meson-tests / meson-tests/common/118 llvm ir and assembly [1;33mSKIP [0m 0.64s exit status 77 >[150-180/350] ð muon:project+meson-tests+requires_python / meson-tests/common/126 generated llvm ir 0/30s[K[150-181/350] ð muon:project+meson-tests+requires_python / meson-tests/common/126 generated llvm ir 0/30s[K150/350 muon:project+meson-tests / meson-tests/common/107 spaces backslash [1;32mOK [0m 1.19s >[151-181/350] ð muon:project+meson-tests+requires_python / meson-tests/common/126 generated llvm ir 0/30s[K[151-182/350] ð muon:project+meson-tests+requires_python / meson-tests/common/126 generated llvm ir 0/30s[K151/350 muon:project+meson-tests+requires_python / meson-tests/common/126 generated llvm ir [1;33mSKIP [0m 0.38s exit status 77 >152/350 muon:project+meson-tests+requires_python / meson-tests/common/95 manygen [1;32mOK [0m 1.80s >[153-182/350] ð muon:project+meson-tests / meson-tests/common/133 c cpp and asm 0/30s[K[153-184/350] ð muon:project+meson-tests / meson-tests/common/133 c cpp and asm 0/30s[K153/350 muon:project+meson-tests+requires_python / meson-tests/common/127 generated assembly [1;33mSKIP [0m 0.40s exit status 77 >[154-184/350] ð muon:project+meson-tests / meson-tests/common/133 c cpp and asm 0/30s[K154/350 muon:project+meson-tests / meson-tests/common/112 subdir subproject [1;32mOK [0m 1.13s >[155-185/350] ð muon:project+meson-tests / meson-tests/common/133 c cpp and asm 0/30s[K155/350 muon:project+meson-tests+requires_python / meson-tests/common/97 find program path [1;32mOK [0m 1.89s >156/350 muon:project+meson-tests+requires_python / meson-tests/common/123 custom target directory install [1;32mOK [0m 0.71s >[157-186/350] ð muon:project+meson-tests / meson-tests/common/133 c cpp and asm 0/30s[K[157-188/350] ð muon:project+meson-tests / meson-tests/common/133 c cpp and asm 0/30s[K157/350 muon:project+meson-tests / meson-tests/common/116 test skip [1;32mOK [0m 1.05s >[158-188/350] ð muon:project+meson-tests / meson-tests/common/133 c cpp and asm 0/30s[K[158-189/350] ð muon:project+meson-tests / meson-tests/common/133 c cpp and asm 0/30s[K158/350 muon:project+meson-tests / meson-tests/common/115 subproject project arguments [1;32mOK [0m 1.18s >[159-189/350] ð muon:project+meson-tests / meson-tests/common/133 c cpp and asm 0/30s[K159/350 muon:project+meson-tests+requires_python / meson-tests/common/110 allgenerate [1;32mOK [0m 1.43s >[160-190/350] ð muon:project+meson-tests / meson-tests/common/133 c cpp and asm 0/30s[K160/350 muon:project+meson-tests / meson-tests/common/117 shared module [1;32mOK [0m 1.16s >[161-191/350] ð muon:project+meson-tests / meson-tests/common/133 c cpp and asm 0/30s[K161/350 muon:project+meson-tests+requires_python / meson-tests/common/105 generatorcustom [1;32mOK [0m 1.75s >[162-192/350] ð muon:project+meson-tests / meson-tests/common/133 c cpp and asm 0/30s[K162/350 muon:project+meson-tests / meson-tests/common/133 c cpp and asm [1;33mSKIP [0m 0.53s exit status 77 >[163-193/350] ð muon:project+meson-tests / meson-tests/common/145 recursive linking 0/30s[K[163-194/350] ð muon:project+meson-tests / meson-tests/common/145 recursive linking 0/30s[K163/350 muon:project+meson-tests / meson-tests/common/124 dependency file generation [1;32mOK [0m 1.02s >164/350 muon:project+meson-tests / meson-tests/common/120 extract all shared library [1;32mOK [0m 1.21s >[165-194/350] ð muon:project+meson-tests / meson-tests/common/145 recursive linking 0/30s[K165/350 muon:project+meson-tests / meson-tests/common/136 empty build file [1;32mOK [0m 0.54s >166/350 muon:project+meson-tests / meson-tests/common/98 subproject subdir [1;32mOK [0m 2.32s >[167-196/350] ð muon:project+meson-tests / meson-tests/common/149 dotinclude 0/30s[K167/350 muon:project+meson-tests / meson-tests/common/122 no buildincdir [1;32mOK [0m 1.30s >168/350 muon:project+meson-tests+requires_python / meson-tests/common/129 build by default [1;32mOK [0m 0.99s >169/350 muon:project+meson-tests+requires_python / meson-tests/common/14 configure file [1;32mOK [0m 6.20s >[170-198/350] ð muon:project+meson-tests / meson-tests/common/149 dotinclude 0/30s[K[170-201/350] ð muon:project+meson-tests / meson-tests/common/149 dotinclude 0/30s[K170/350 muon:project+meson-tests+requires_python / meson-tests/common/125 configure file in generator [1;32mOK [0m 1.34s >171/350 muon:project+meson-tests+requires_python / meson-tests/common/128 build by default targets in tests [1;32mOK [0m 1.21s >172/350 muon:project+meson-tests / meson-tests/common/104 has arg [1;32mOK [0m 2.32s >[173-201/350] ð muon:project+meson-tests / meson-tests/common/149 dotinclude 0/30s[K173/350 muon:project+meson-tests / meson-tests/common/131 override options [1;32mOK [0m 1.24s >174/350 muon:project+meson-tests+requires_python / meson-tests/common/140 custom target multiple outputs [1;32mOK [0m 0.91s >[175-204/350] ð muon:project+meson-tests / meson-tests/common/149 dotinclude 0/30s[K[175-206/350] ð muon:project+meson-tests / meson-tests/common/149 dotinclude 0/30s[K175/350 muon:project+meson-tests+requires_python / meson-tests/common/143 list of file sources [1;32mOK [0m 0.99s >[176-206/350] ð muon:project+meson-tests / meson-tests/common/149 dotinclude 0/30s[K176/350 muon:project+meson-tests / meson-tests/common/94 threads [1;32mOK [0m 3.28s >177/350 muon:project+meson-tests / meson-tests/common/142 nested links [1;32mOK [0m 1.12s >178/350 muon:project+meson-tests+requires_python / meson-tests/common/130 include order [1;32mOK [0m 1.65s >[179-207/350] ð muon:project+meson-tests / meson-tests/common/149 dotinclude 0/30s[K[179-210/350] ð muon:project+meson-tests / meson-tests/common/149 dotinclude 1/30s[K179/350 muon:project+meson-tests+requires_python / meson-tests/common/135 custom target object output [1;32mOK [0m 1.59s >[180-210/350] ð muon:project+meson-tests / meson-tests/common/149 dotinclude 1/30s[K[180-211/350] ð muon:project+meson-tests / meson-tests/common/165 get project license 0/30s[K180/350 muon:project+meson-tests / meson-tests/common/137 whole archive [1;32mOK [0m 1.57s >[181-211/350] ð muon:project+meson-tests / meson-tests/common/165 get project license 0/30s[K181/350 muon:project+meson-tests+requires_python / meson-tests/common/144 link depends custom target [1;32mOK [0m 1.36s >[182-212/350] ð muon:project+meson-tests / meson-tests/common/165 get project license 0/30s[K[182-213/350] ð muon:project+meson-tests / meson-tests/common/165 get project license 0/30s[K182/350 muon:project+meson-tests / meson-tests/common/159 array option [1;32mOK [0m 0.69s >[183-213/350] ð muon:project+meson-tests / meson-tests/common/165 get project license 0/30s[K183/350 muon:project+meson-tests / meson-tests/common/146 library at root [1;32mOK [0m 1.40s >[184-214/350] ð muon:project+meson-tests / meson-tests/common/165 get project license 0/30s[K[184-215/350] ð muon:project+meson-tests / meson-tests/common/165 get project license 0/30s[K184/350 muon:project+meson-tests / meson-tests/common/149 dotinclude [1;32mOK [0m 1.35s >185/350 muon:project+meson-tests / meson-tests/common/148 shared module resolving symbol in executable [1;32mOK [0m 1.39s >[186-215/350] ð muon:project+meson-tests / meson-tests/common/165 get project license 0/30s[K[186-217/350] ð muon:project+meson-tests / meson-tests/common/165 get project license 0/30s[K186/350 muon:project+meson-tests+requires_python / meson-tests/common/141 special characters [1;32mOK [0m 1.79s >[187-217/350] ð muon:project+meson-tests / meson-tests/common/165 get project license 0/30s[K187/350 muon:project+meson-tests / meson-tests/common/163 default options prefix dependent defaults [1;32mOK [0m 0.57s >188/350 muon:project+meson-tests / meson-tests/common/151 duplicate source names [1;32mOK [0m 1.40s >[189-218/350] ð muon:project+meson-tests / meson-tests/common/165 get project license 0/30s[K[189-220/350] ð muon:project+meson-tests / meson-tests/common/165 get project license 0/30s[K189/350 muon:project+meson-tests / meson-tests/common/166 yield [1;32mOK [0m 0.46s >190/350 muon:project+meson-tests / meson-tests/common/162 subdir if_found [1;32mOK [0m 0.71s >191/350 muon:project+meson-tests+requires_python / meson-tests/common/150 reserved targets [1;32mOK [0m 1.54s >[192-220/350] ð muon:project+meson-tests / meson-tests/common/165 get project license 0/30s[K[192-223/350] ð muon:project+meson-tests / meson-tests/common/165 get project license 0/30s[K192/350 muon:project+meson-tests / meson-tests/common/145 recursive linking [1;32mOK [0m 1.85s >193/350 muon:project+meson-tests / meson-tests/common/154 includedir subproj [1;32mOK [0m 1.46s >[194-223/350] ð muon:project+meson-tests / meson-tests/common/165 get project license 0/30s[K[194-225/350] ð muon:project+meson-tests / meson-tests/common/165 get project license 0/30s[K194/350 muon:project+meson-tests / meson-tests/common/158 disabler [1;32mOK [0m 1.33s >195/350 muon:project+meson-tests / meson-tests/common/161 not-found dependency [1;32mOK [0m 1.03s >[196-225/350] ð muon:project+meson-tests / meson-tests/common/165 get project license 0/30s[K196/350 muon:project+meson-tests / meson-tests/common/153 wrap file should not failed [1;32mOK [0m 1.66s >[197-227/350] ð muon:project+meson-tests / meson-tests/common/165 get project license 0/30s[K[197-228/350] ð muon:project+meson-tests / meson-tests/common/165 get project license 0/30s[K197/350 muon:project+meson-tests / meson-tests/common/155 subproject dir name collision [1;32mOK [0m 1.58s >[198-228/350] ð muon:project+meson-tests / meson-tests/common/165 get project license 0/30s[K[198-229/350] ð muon:project+meson-tests / meson-tests/common/165 get project license 0/30s[K198/350 muon:project+meson-tests+requires_python / meson-tests/common/152 index customtarget [1;32mOK [0m 1.80s >[199-229/350] ð muon:project+meson-tests / meson-tests/common/165 get project license 0/30s[K[199-230/350] ð muon:project+meson-tests / meson-tests/common/165 get project license 0/30s[K199/350 muon:project+meson-tests / meson-tests/common/176 subproject version [1;32mOK [0m 0.40s >[200-230/350] ð muon:project+meson-tests / meson-tests/common/165 get project license 1/30s[K200/350 muon:project+meson-tests+requires_python / meson-tests/common/157 custom target subdir depend files [1;32mOK [0m 1.69s >201/350 muon:project+meson-tests / meson-tests/common/177 subdir_done [1;32mOK [0m 0.43s >202/350 muon:project+meson-tests / meson-tests/common/28 try compile [1;32mOK [0m 7.64s >[203-231/350] ð muon:project+meson-tests+requires_python / meson-tests/common/186 test depends 0/30s[K[203-234/350] ð muon:project+meson-tests+requires_python / meson-tests/common/186 test depends 0/30s[K203/350 muon:project+meson-tests / meson-tests/common/165 get project license [1;32mOK [0m 1.20s >[204-234/350] ð muon:project+meson-tests+requires_python / meson-tests/common/186 test depends 0/30s[K[204-235/350] ð muon:project+meson-tests+requires_python / meson-tests/common/186 test depends 0/30s[K204/350 muon:project+meson-tests+requires_python / meson-tests/common/160 custom target template substitution [1;32mOK [0m 1.71s >[205-235/350] ð muon:project+meson-tests+requires_python / meson-tests/common/186 test depends 0/30s[K205/350 muon:project+meson-tests / meson-tests/common/89 default library [1;32mOK [0m 5.07s >206/350 muon:project+meson-tests / meson-tests/common/167 subproject nested subproject dirs [1;32mOK [0m 1.21s >207/350 muon:project+meson-tests / meson-tests/common/171 initial c_args [1;32mOK [0m 0.99s >[208-236/350] ð muon:project+meson-tests+requires_python / meson-tests/common/186 test depends 0/30s[K[208-239/350] ð muon:project+meson-tests+requires_python / meson-tests/common/186 test depends 0/30s[K208/350 muon:project+meson-tests+requires_python / meson-tests/common/121 object only target [1;32mOK [0m 3.72s >[209-239/350] ð muon:project+meson-tests+requires_python / meson-tests/common/186 test depends 0/30s[K[209-240/350] ð muon:project+meson-tests+requires_python / meson-tests/common/186 test depends 0/30s[K209/350 muon:project+meson-tests / meson-tests/common/164 dependency factory [1;32mOK [0m 1.61s >[210-240/350] ð muon:project+meson-tests+requires_python / meson-tests/common/186 test depends 0/30s[K210/350 muon:project+meson-tests / meson-tests/common/172 identical target name in subproject flat layout [1;32mOK [0m 1.17s >211/350 muon:project+meson-tests+requires_python / meson-tests/common/169 source in dep [1;32mOK [0m 1.33s >212/350 muon:project+meson-tests / meson-tests/common/82 add language [1;32mOK [0m 5.71s >213/350 muon:project+meson-tests / meson-tests/common/187 args flattening [1;32mOK [0m 0.53s >214/350 muon:project+meson-tests / meson-tests/common/174 ndebug if-release enabled [1;32mOK [0m 1.13s >[215-241/350] ð muon:project+meson-tests+requires_python / meson-tests/common/186 test depends 0/30s[K[215-246/350] ð muon:project+meson-tests+requires_python / meson-tests/common/186 test depends 0/30s[K215/350 muon:project+meson-tests+requires_python / meson-tests/common/168 preserve gendir [1;32mOK [0m 1.57s >[216-246/350] ð muon:project+meson-tests+requires_python / meson-tests/common/186 test depends 0/30s[K216/350 muon:project+meson-tests / meson-tests/common/175 ndebug if-release disabled [1;32mOK [0m 1.25s >[217-247/350] ð muon:project+meson-tests+requires_python / meson-tests/common/186 test depends 0/30s[K[217-248/350] ð muon:project+meson-tests+requires_python / meson-tests/common/186 test depends 0/30s[K217/350 muon:project+meson-tests / meson-tests/common/173 as-needed [1;32mOK [0m 1.39s >218/350 muon:project+meson-tests / meson-tests/common/191 subproject array version [1;32mOK [0m 0.58s >[219-248/350] ð muon:project+meson-tests+requires_python / meson-tests/common/186 test depends 0/30s[K219/350 muon:project+meson-tests+requires_python / meson-tests/common/170 generator link whole [1;32mOK [0m 1.61s >220/350 muon:project+meson-tests / meson-tests/common/193 feature option disabled [1;32mOK [0m 0.54s >221/350 muon:project+meson-tests / meson-tests/common/185 same target name [1;32mOK [0m 1.00s >222/350 muon:project+meson-tests / meson-tests/common/181 same target name flat layout [1;32mOK [0m 1.17s >[223-250/350] ð muon:project+meson-tests+requires_python / meson-tests/common/186 test depends 0/30s[K[223-254/350] ð muon:project+meson-tests+requires_python / meson-tests/common/209 link custom_i single from multiple 0/30s[K223/350 muon:project+meson-tests / meson-tests/common/183 partial dependency [1;32mOK [0m 1.19s >[224-254/350] ð muon:project+meson-tests+requires_python / meson-tests/common/209 link custom_i single from multiple 0/30s[K[224-255/350] ð muon:project+meson-tests+requires_python / meson-tests/common/209 link custom_i single from multiple 0/30s[K224/350 muon:project+meson-tests / meson-tests/common/192 feature option [1;32mOK [0m 0.77s >[225-255/350] ð muon:project+meson-tests+requires_python / meson-tests/common/209 link custom_i single from multiple 0/30s[K225/350 muon:project+meson-tests+requires_python / meson-tests/common/186 test depends [1;32mOK [0m 1.17s >226/350 muon:project+meson-tests / meson-tests/common/198 broken subproject [1;32mOK [0m 0.54s >227/350 muon:project+meson-tests / meson-tests/common/188 dict [1;32mOK [0m 1.09s >228/350 muon:project+meson-tests+requires_python / meson-tests/common/179 escape and unicode [1;32mOK [0m 1.51s >229/350 muon:project+meson-tests / meson-tests/common/199 argument syntax [1;32mOK [0m 0.53s >230/350 muon:project+meson-tests+requires_python / meson-tests/common/202 custom target build by default [1;32mOK [0m 0.44s >[231-256/350] ð muon:project+meson-tests+requires_python / meson-tests/common/209 link custom_i single from multiple 0/30s[K231/350 muon:project+meson-tests / meson-tests/common/190 install_mode [1;32mOK [0m 1.21s >[232-262/350] ð muon:project+meson-tests+requires_python / meson-tests/common/209 link custom_i single from multiple 0/30s[K[232-263/350] ð muon:project+meson-tests+requires_python / meson-tests/common/209 link custom_i single from multiple 0/30s[K232/350 muon:project+meson-tests / meson-tests/common/204 line continuation [1;32mOK [0m 0.60s >[233-263/350] ð muon:project+meson-tests+requires_python / meson-tests/common/209 link custom_i single from multiple 0/30s[K[233-264/350] ð muon:project+meson-tests+requires_python / meson-tests/common/209 link custom_i single from multiple 0/30s[K233/350 muon:project+meson-tests / meson-tests/common/194 static threads [1;32mOK [0m 1.10s >234/350 muon:project+meson-tests / meson-tests/common/200 install name_prefix name_suffix [1;32mOK [0m 0.84s >[235-264/350] ð muon:project+meson-tests+requires_python / meson-tests/common/209 link custom_i single from multiple 0/30s[K[235-266/350] ð muon:project+meson-tests+requires_python / meson-tests/common/209 link custom_i single from multiple 0/30s[K235/350 muon:project+meson-tests+requires_python / meson-tests/common/182 find override [1;32mOK [0m 1.79s >236/350 muon:project+meson-tests / meson-tests/common/196 subproject with features [1;32mOK [0m 1.09s >[237-266/350] ð muon:project+meson-tests+requires_python / meson-tests/common/209 link custom_i single from multiple 0/30s[K[237-268/350] ð muon:project+meson-tests+requires_python / meson-tests/common/209 link custom_i single from multiple 0/30s[K237/350 muon:project+meson-tests / meson-tests/common/201 kwarg entry [1;32mOK [0m 0.99s >238/350 muon:project+meson-tests+requires_python / meson-tests/common/13 pch [1;32mOK [0m 9.84s >[239-268/350] ð muon:project+meson-tests+requires_python / meson-tests/common/209 link custom_i single from multiple 0/30s[K239/350 muon:project+meson-tests / meson-tests/common/203 find_library and headers [1;32mOK [0m 1.02s >240/350 muon:project+meson-tests / meson-tests/common/211 dependency get_variable method [1;32mOK [0m 0.71s >[241-270/350] ð muon:project+meson-tests+requires_python / meson-tests/common/209 link custom_i single from multiple 0/30s[K[241-272/350] ð muon:project+meson-tests+requires_python / meson-tests/common/209 link custom_i single from multiple 0/30s[K241/350 muon:project+meson-tests+requires_python / meson-tests/common/195 generator in subdir [1;32mOK [0m 1.51s >[242-272/350] ð muon:project+meson-tests+requires_python / meson-tests/common/209 link custom_i single from multiple 0/30s[K[242-273/350] ð muon:project+meson-tests+requires_python / meson-tests/common/209 link custom_i single from multiple 1/30s[K242/350 muon:project+meson-tests / meson-tests/common/221 zlib [1;33mSKIP [0m 0.48s exit status 77 >243/350 muon:project+meson-tests+requires_python / meson-tests/common/217 test priorities [1;32mOK [0m 0.70s >[244-273/350] ð muon:project+meson-tests / meson-tests/common/231 subdir files 0/30s[K244/350 muon:project+meson-tests / meson-tests/common/219 include_type dependency [1;32mOK [0m 0.69s >[245-275/350] ð muon:project+meson-tests / meson-tests/common/231 subdir files 0/30s[K245/350 muon:project+meson-tests / meson-tests/common/206 tap tests [1;32mOK [0m 1.27s >246/350 muon:project+meson-tests / meson-tests/common/224 arithmetic operators [1;32mOK [0m 0.57s >[247-276/350] ð muon:project+meson-tests / meson-tests/common/231 subdir files 0/30s[K[247-278/350] ð muon:project+meson-tests / meson-tests/common/231 subdir files 0/30s[K247/350 muon:project+meson-tests / meson-tests/common/132 get define [1;32mOK [0m 5.14s >248/350 muon:project+meson-tests / meson-tests/common/218 include_dir dot [1;32mOK [0m 0.98s >[249-278/350] ð muon:project+meson-tests / meson-tests/common/231 subdir files 0/30s[K[249-280/350] ð muon:project+meson-tests / meson-tests/common/231 subdir files 0/30s[K249/350 muon:project+meson-tests / meson-tests/common/212 source set configuration_data [1;32mOK [0m 1.29s >[250-280/350] ð muon:project+meson-tests / meson-tests/common/231 subdir files 0/30s[K250/350 muon:project+meson-tests / meson-tests/common/213 source set dictionary [1;32mOK [0m 1.30s >[251-281/350] ð muon:project+meson-tests / meson-tests/common/231 subdir files 0/30s[K[251-282/350] ð muon:project+meson-tests / meson-tests/common/231 subdir files 0/30s[K251/350 muon:project+meson-tests / meson-tests/common/220 fs module [1;32mOK [0m 1.08s >[252-282/350] ð muon:project+meson-tests / meson-tests/common/231 subdir files 0/30s[K252/350 muon:project+meson-tests+requires_python / meson-tests/common/214 source set custom target [1;32mOK [0m 1.41s >253/350 muon:project+meson-tests / meson-tests/common/234 get_file_contents [1;32mOK [0m 0.52s >254/350 muon:project+meson-tests+requires_python / meson-tests/common/216 custom target input extracted objects [1;32mOK [0m 1.37s >[255-283/350] ð muon:project+meson-tests / meson-tests/common/231 subdir files 0/30s[K[255-286/350] ð muon:project+meson-tests / meson-tests/common/231 subdir files 0/30s[K255/350 muon:project+meson-tests+requires_python / meson-tests/common/208 link custom [1;32mOK [0m 1.83s >256/350 muon:project+meson-tests / meson-tests/common/237 fstrings [1;32mOK [0m 0.43s >[257-286/350] ð muon:project+meson-tests / meson-tests/common/231 subdir files 0/30s[K257/350 muon:project+meson-tests / meson-tests/common/229 disabler array addition [1;32mOK [0m 1.00s >258/350 muon:project+meson-tests / meson-tests/common/239 includedir violation [1;32mOK [0m 0.42s >[259-288/350] ð muon:project+meson-tests / meson-tests/common/231 subdir files 0/30s[K[259-290/350] ð muon:project+meson-tests / meson-tests/common/231 subdir files 1/30s[K259/350 muon:project+meson-tests / meson-tests/common/225 link language [1;32mOK [0m 1.29s >[260-290/350] ð muon:project+meson-tests / meson-tests/common/231 subdir files 1/30s[K260/350 muon:project+meson-tests+requires_python / meson-tests/common/209 link custom_i single from multiple [1;32mOK [0m 2.02s >261/350 muon:project+meson-tests / meson-tests/common/231 subdir files [1;32mOK [0m 1.07s >262/350 muon:project+meson-tests / meson-tests/common/241 set and get variable [1;32mOK [0m 0.44s >263/350 muon:project+meson-tests / meson-tests/common/138 C and CPP link [1;32mOK [0m 5.57s >[264-291/350] ð muon:project+meson-tests / meson-tests/common/249 install_symlink 0/30s[K264/350 muon:project+meson-tests / meson-tests/common/232 dependency allow_fallback [1;32mOK [0m 1.13s >[265-295/350] ð muon:project+meson-tests / meson-tests/common/249 install_symlink 0/30s[K[265-296/350] ð muon:project+meson-tests / meson-tests/common/249 install_symlink 0/30s[K265/350 muon:project+meson-tests+requires_python / meson-tests/common/210 link custom_i multiple from multiple [1;32mOK [0m 2.19s >266/350 muon:project+meson-tests / meson-tests/common/244 variable scope [1;32mOK [0m 0.49s >267/350 muon:project+meson-tests+requires_python / meson-tests/common/228 custom_target source [1;32mOK [0m 1.44s >268/350 muon:project+meson-tests / meson-tests/common/238 dependency include_type inconsistency [1;32mOK [0m 0.84s >[269-296/350] ð muon:project+meson-tests / meson-tests/common/249 install_symlink 0/30s[K269/350 muon:project+meson-tests / meson-tests/common/235 invalid standard overridden to valid [1;32mOK [0m 1.17s >270/350 muon:project+meson-tests / meson-tests/common/189 check header [1;32mOK [0m 3.30s >271/350 muon:project+meson-tests / meson-tests/common/236 proper args splitting [1;32mOK [0m 1.14s >272/350 muon:project+meson-tests / meson-tests/common/246 dependency fallbacks [1;32mOK [0m 0.55s >273/350 muon:project+meson-tests / meson-tests/common/240 dependency native host == build [1;32mOK [0m 0.90s >274/350 muon:project+meson-tests / meson-tests/common/233 wrap case [1;32mOK [0m 1.35s >275/350 muon:project+meson-tests+requires_python / meson-tests/common/247 deprecated option [1;32mOK [0m 0.53s >276/350 muon:project+meson-tests+requires_python / meson-tests/common/226 link depends indexed custom target [1;32mOK [0m 1.72s >[277-300/350] ð muon:project+meson-tests / meson-tests/common/249 install_symlink 0/30s[K277/350 muon:project+meson-tests / meson-tests/common/248 install_emptydir [1;32mOK [0m 0.76s >[278-308/350] ð muon:project+meson-tests / meson-tests/common/249 install_symlink 0/30s[K[278-309/350] ð muon:project+meson-tests / meson-tests/common/249 install_symlink 0/30s[K278/350 muon:project+meson-tests / meson-tests/common/249 install_symlink [1;32mOK [0m 0.76s >[279-309/350] ð muon:project+meson-tests / meson-tests/common/270 int_to_str_fill 0/30s[K279/350 muon:project+meson-tests+requires_python / meson-tests/common/242 custom target feed [1;32mOK [0m 1.12s >280/350 muon:project+meson-tests / meson-tests/common/134 compute int [1;32mOK [0m 6.51s >281/350 muon:project+meson-tests+requires_python / meson-tests/common/178 bothlibraries [1;32mOK [0m 4.22s >[282-310/350] ð muon:project+meson-tests / meson-tests/common/270 int_to_str_fill 0/30s[K282/350 muon:project+meson-tests / meson-tests/common/180 has link arg [1;32mOK [0m 4.26s >283/350 muon:project+meson-tests / meson-tests/common/243 escape++ [1;32mOK [0m 1.25s >284/350 muon:project+meson-tests+requires_python / meson-tests/common/252 install data structured [1;32mOK [0m 0.86s >[285-313/350] ð muon:project+meson-tests / meson-tests/common/270 int_to_str_fill 0/30s[K[285-316/350] ð muon:project+meson-tests+requires_python / meson-tests/python/1 basic 0/30s[K285/350 muon:project+meson-tests / meson-tests/common/258 subsubproject inplace [1;32mOK [0m 0.78s >[286-316/350] ð muon:project+meson-tests+requires_python / meson-tests/python/1 basic 0/30s[K[286-317/350] ð muon:project+meson-tests+requires_python / meson-tests/python/1 basic 0/30s[K286/350 muon:project+meson-tests / meson-tests/common/266 format string [1;32mOK [0m 0.56s >287/350 muon:project+meson-tests / meson-tests/common/250 system include dir [1;32mOK [0m 1.11s >288/350 muon:project+meson-tests / meson-tests/common/253 subproject dependency variables [1;32mOK [0m 1.03s >[289-317/350] ð muon:project+meson-tests+requires_python / meson-tests/python/1 basic 0/30s[K289/350 muon:project+meson-tests / meson-tests/common/270 int_to_str_fill [1;32mOK [0m 0.58s >290/350 muon:project+meson-tests / meson-tests/common/256 subproject extracted objects [1;32mOK [0m 1.03s >[291-320/350] ð muon:project+meson-tests+requires_python / meson-tests/python/1 basic 0/30s[K[291-322/350] ð muon:project+meson-tests+requires_python / meson-tests/python/1 basic 0/30s[K291/350 muon:project+meson-tests / meson-tests/common/263 internal dependency includes in checks [1;32mOK [0m 0.87s >292/350 muon:project+meson-tests+requires_python / meson-tests/common/269 configure file output format [1;32mOK [0m 0.73s >[293-322/350] ð muon:project+meson-tests+requires_python / meson-tests/python/1 basic 0/30s[K293/350 muon:project+meson-tests / meson-tests/common/257 generated header dep [1;32mOK [0m 1.19s >[294-324/350] ð muon:project+meson-tests+requires_python / meson-tests/python/1 basic 0/30s[K[294-325/350] ð muon:project+meson-tests+requires_python / meson-tests/python/1 basic 0/30s[K294/350 muon:project+meson-tests / meson-tests/common/251 add_project_dependencies [1;32mOK [0m 1.46s >295/350 muon:project+meson-tests / meson-tests/common/265 default_options dict [1;32mOK [0m 0.98s >296/350 muon:project+meson-tests / meson-tests/common/260 declare_dependency objects [1;32mOK [0m 1.11s >[297-325/350] ð muon:project+meson-tests+requires_python / meson-tests/python/1 basic 0/30s[K297/350 muon:project+meson-tests+requires_python / meson-tests/common/274 environment [1;32mOK [0m 0.78s >[298-328/350] ð muon:project+meson-tests+requires_python / meson-tests/python/1 basic 0/30s[K[298-329/350] ð muon:project+meson-tests+requires_python / meson-tests/python/1 basic 0/30s[K298/350 muon:project+meson-tests / meson-tests/common/267 default_options in find_program [1;32mOK [0m 1.08s >299/350 muon:project+meson-tests / meson-tests/common/277 custom target private dir [1;32mOK [0m 0.69s >[300-329/350] ð muon:project+meson-tests+requires_python / meson-tests/python/1 basic 0/30s[K300/350 muon:project+meson-tests+requires_python / meson-tests/python/6 failing subproject [1;33mEXPECTEDFAIL [0m 0.60s exit status 1 >[301-331/350] ð muon:project+meson-tests+requires_python / meson-tests/python/1 basic 0/30s[K301/350 muon:project+meson-tests+requires_python / meson-tests/common/245 custom target index source [1;32mOK [0m 2.01s >[302-332/350] ð muon:project+meson-tests+requires_python / meson-tests/python/1 basic 0/30s[K302/350 muon:project+meson-tests+requires_python / meson-tests/common/273 customtarget exe for test [1;32mOK [0m 1.03s >303/350 muon:project+meson-tests / meson-tests/common/259 preprocess [1;32mOK [0m 1.53s >[304-333/350] ð muon:project+meson-tests+requires_python / meson-tests/python/1 basic 0/30s[K304/350 muon:project+meson-tests / meson-tests/native/1 trivial [1;32mOK [0m 0.70s >[305-335/350] ð muon:project+meson-tests+requires_python / meson-tests/python/1 basic 0/30s[K[305-336/350] ð muon:project+meson-tests+requires_python / meson-tests/python/1 basic 0/30s[K305/350 muon:project+meson-tests+requires_python / meson-tests/python/1 basic [1;32mOK [0m 0.94s >[306-336/350] ð muon:project+meson-tests / meson-tests/keyval/4 load_config builddir 0/30s[K306/350 muon:project+meson-tests+requires_python / meson-tests/common/271 env in generator.process [1;32mOK [0m 1.27s >307/350 muon:project+meson-tests / meson-tests/common/276 generator custom_tgt subdir [1;32mOK [0m 1.06s >[308-337/350] ð muon:project+meson-tests / meson-tests/keyval/4 load_config builddir 0/30s[K[308-339/350] ð muon:analyze / commands/copyfile.meson 0/30s[K308/350 muon:project+meson-tests / meson-tests/nasm/1 configure file [1;33mSKIP [0m 0.44s exit status 77 >309/350 muon:project+meson-tests+requires_python / meson-tests/common/262 generator chain [1;32mOK [0m 1.64s >310/350 muon:project+meson-tests / meson-tests/common/254 long output [1;32mOK [0m 1.95s >[311-339/350] ð muon:analyze / commands/copyfile.meson 0/30s[K311/350 muon:project+meson-tests / meson-tests/nasm/2 asm language [1;33mEXPECTEDFAIL [0m 0.50s exit status 1 >312/350 muon:project+meson-tests / meson-tests/nasm/3 nasm only [1;33mSKIP [0m 0.48s exit status 77 >[313-342/350] ð muon:analyze / commands/copyfile.meson 0/30s[K313/350 muon:project+meson-tests / meson-tests/nasm/4 through configure [1;33mSKIP [0m 0.50s exit status 77 >[314-344/350] ð muon:analyze / commands/copyfile.meson 0/30s[K[314-345/350] ð muon:analyze / commands/copyfile.meson 0/30s[K314/350 muon:project+meson-tests+requires_python / meson-tests/python/7 install path [1;32mOK [0m 1.14s >[315-345/350] ð muon:analyze / commands/copyfile.meson 0/30s[K315/350 muon:project+meson-tests / meson-tests/keyval/1 basic [1;32mOK [0m 0.56s >[316-346/350] ð muon:analyze / commands/copyfile.meson 0/30s[K316/350 muon:project+meson-tests / meson-tests/keyval/2 subdir [1;32mOK [0m 0.55s >[317-347/350] ð muon:analyze / commands/copyfile.meson 0/30s[K317/350 muon:project+meson-tests / meson-tests/native/2 global arg [1;32mOK [0m 1.18s >318/350 muon:project+meson-tests / meson-tests/keyval/3 load_config files [1;32mOK [0m 0.57s >319/350 muon:project+meson-tests / meson-tests/keyval/4 load_config builddir [1;32mOK [0m 0.53s >320/350 muon:project+meson-tests+requires_python / meson-tests/python/5 modules kwarg [1;32mOK [0m 1.39s >321/350 muon:project+meson-tests / meson-tests/common/275 required keyword in compiles functions [1;32mOK [0m 1.60s >[322-348/350] ð muon:analyze / commands/copyfile.meson 0/30s[K[322-350/350] ð muon:analyze / commands/copyfile.meson 0/30s[K322/350 muon:analyze / commands/copyfile.meson [1;32mOK [0m 0.50s >[323-350/350] ð muon:analyze / runtime/dependencies.meson 0/30s[K323/350 muon:analyze / commands/coverage.meson [1;32mOK [0m 0.45s >324/350 muon:analyze / commands/delete_suffix.meson [1;32mOK [0m 0.43s >325/350 muon:analyze / commands/i18n/gettext.meson [1;32mOK [0m 0.41s >[326-350/350] ð muon:analyze / runtime/dependencies.meson 0/30s[K326/350 muon:analyze / commands/i18n/itstool.meson [1;32mOK [0m 0.37s >327/350 muon:analyze / commands/i18n/msgfmthelper.meson [1;32mOK [0m 0.36s >[328-350/350] ð muon:analyze / runtime/dependencies.meson 0/30s[K328/350 muon:analyze / commands/vcs_tagger.meson [1;32mOK [0m 0.32s >[329-350/350] ð muon:analyze / runtime/dependencies.meson 0/30s[K329/350 muon:analyze / lib/cmake_prelude.meson [1;32mOK [0m 0.28s >[330-350/350] ð muon:analyze / runtime/dependencies.meson 0/30s[K330/350 muon:analyze / modules/_test.meson [1;32mOK [0m 0.25s >[331-350/350] ð muon:analyze / runtime/dependencies.meson 0/30s[K331/350 muon:analyze / modules/gnome.meson [1;32mOK [0m 0.22s >[332-350/350] ð muon:analyze / runtime/dependencies.meson 0/30s[K332/350 muon:project+meson-tests+requires_python / meson-tests/frameworks/7 gnome [1;31mFAIL [0m 0.62s exit status 1 >[1;31m>>> [0mMALLOC_PERTURB_=8 ASAN_OPTIONS=halt_on_error=1:abort_on_error=1:print_summary=1 MSAN_OPTIONS=halt_on_error=1:abort_on_error=1:print_summary=1:print_stacktrace=1 MESON_TEST_ITERATION=1 UBSAN_OPTIONS=halt_on_error=1:abort_on_error=1:print_summary=1:print_stacktrace=1 /var/tmp/portage/dev-build/muon-0.4.0/work/muon-0.4.0-build/muon internal eval /var/tmp/portage/dev-build/muon-0.4.0/work/muon-v0.4.0/tests/project/runner.meson ./muon /usr/bin/ninja '/var/tmp/portage/dev-build/muon-0.4.0/work/muon-v0.4.0/subprojects/meson-tests/frameworks/7 gnome' '/var/tmp/portage/dev-build/muon-0.4.0/work/muon-0.4.0-build/tests/project/meson-tests/frameworks/7 gnome' 77 0 0 > â >checking compiler ['cc'] >dbg executing /usr/bin/cc: 'cc' '--version' >dbg executing /usr/bin/cc: 'cc' '-print-search-dirs' >dbg executing /usr/bin/cc: 'cc' '-dumpmachine' >dbg reconstructed triplet: riscv64-unknown-linux-gnu >dbg executing /usr/bin/ld: 'ld' '--version' >dbg executing /usr/bin/ar: 'ar' '--version' >detected host compiler for c: gcc '14.2.1' (['cc']), linker: ld (['ld']), static_linker: ar (['ar']) >checking compiler ['cc'] >dbg reconstructed triplet: riscv64-unknown-linux-gnu >detected build compiler for c: gcc '14.2.1' (['cc']), linker: ld (['ld']), static_linker: ar (['ar']) >configuring 'gobject-introspection', version: undefined >dbg libpkgconf: looking up glib-2.0 dynamic >dbg libpkgconf: dependency 'glib-2.0' found required library '/usr/lib64/libglib-2.0.so' >found dependency glib-2.0 version 2.82.5 for the host machine >dbg executing /usr/bin/python3: '/usr/bin/python3' '-c' 'import os, sys >if "MESON_UNIT_TEST_PRETEND_GLIB_OLD" in os.environ: > sys.exit(0) >sys.exit(1) >' >dbg env: MUON_PATH='/var/tmp/portage/dev-build/muon-0.4.0/work/muon-0.4.0-build/muon' MESON_BUILD_ROOT='/var/tmp/portage/dev-build/muon-0.4.0/work/muon-0.4.0-build/tests/project/meson-tests/frameworks/7 gnome' MESON_SOURCE_ROOT='/var/tmp/portage/dev-build/muon-0.4.0/work/muon-v0.4.0/subprojects/meson-tests/frameworks/7 gnome' MESON_SUBDIR='.' >dbg libpkgconf: looking up gio-2.0 dynamic >dbg libpkgconf: dependency 'gio-2.0' found required library '/usr/lib64/libgio-2.0.so' >dbg libpkgconf: dependency 'gio-2.0' found required library '/usr/lib64/libglib-2.0.so' >dbg libpkgconf: dependency 'gio-2.0' found required library '/usr/lib64/libgobject-2.0.so' >dbg libpkgconf: skipping null pkgconf fragment: '-pthread' >found dependency gio-2.0 version 2.82.5 for the host machine >dbg libpkgconf: looking up gio-unix-2.0 dynamic >dbg libpkgconf: dependency 'gio-unix-2.0' found required library '/usr/lib64/libgobject-2.0.so' >dbg libpkgconf: dependency 'gio-unix-2.0' found required library '/usr/lib64/libglib-2.0.so' >dbg libpkgconf: dependency 'gio-unix-2.0' found required library '/usr/lib64/libgio-2.0.so' >dbg libpkgconf: skipping null pkgconf fragment: '-pthread' >found dependency gio-unix-2.0 version 2.82.5 for the host machine >dbg libpkgconf: looking up gobject-2.0 dynamic >dbg libpkgconf: dependency 'gobject-2.0' found required library '/usr/lib64/libgobject-2.0.so' >dbg libpkgconf: dependency 'gobject-2.0' found required library '/usr/lib64/libglib-2.0.so' >found dependency gobject-2.0 version 2.82.5 for the host machine >dbg libpkgconf: looking up gmodule-2.0 dynamic >dbg libpkgconf: skipping null pkgconf fragment: '-Wl,--export-dynamic' >dbg libpkgconf: dependency 'gmodule-2.0' found required library '/usr/lib64/libgmodule-2.0.so' >dbg libpkgconf: skipping null pkgconf fragment: '-pthread' >dbg libpkgconf: dependency 'gmodule-2.0' found required library '/usr/lib64/libglib-2.0.so' >dbg libpkgconf: skipping null pkgconf fragment: '-pthread' >found dependency gmodule-2.0 version 2.82.5 for the host machine >configuring '/var/tmp/portage/dev-build/muon-0.4.0/work/muon-0.4.0-build/tests/project/meson-tests/frameworks/7 gnome/resources-data/subdir/res4.txt' >dbg adding custom target 'res3' >configuring '/var/tmp/portage/dev-build/muon-0.4.0/work/muon-0.4.0-build/tests/project/meson-tests/frameworks/7 gnome/resources/simple-gen.gresource.xml' >dbg executing /usr/bin/env: '/usr/bin/env' 'python3' '/var/tmp/portage/dev-build/muon-0.4.0/work/muon-v0.4.0/subprojects/meson-tests/frameworks/7 gnome/copyfile.py' '/var/tmp/portage/dev-build/muon-0.4.0/work/muon-v0.4.0/subprojects/meson-tests/frameworks/7 gnome/resources/simple.gresource.xml' '/var/tmp/portage/dev-build/muon-0.4.0/work/muon-0.4.0-build/tests/project/meson-tests/frameworks/7 gnome/resources/simple-gen.gresource.xml' >dbg env: MUON_PATH='/var/tmp/portage/dev-build/muon-0.4.0/work/muon-0.4.0-build/muon' MESON_BUILD_ROOT='/var/tmp/portage/dev-build/muon-0.4.0/work/muon-0.4.0-build/tests/project/meson-tests/frameworks/7 gnome' MESON_SOURCE_ROOT='/var/tmp/portage/dev-build/muon-0.4.0/work/muon-v0.4.0/subprojects/meson-tests/frameworks/7 gnome' MESON_SUBDIR='resources' >dbg adding custom target 'simple-resources_c' >dbg adding custom target 'simple-resources_h' >dbg adding build target simple-resources-test >dbg adding custom target 'generated-resources_c' >dbg adding custom target 'generated-resources_h' >dbg adding build target generated-resources-test >dbg adding custom target 'simple-ct.gresource.xml' >dbg adding custom target 'ct-resources_c' >dbg adding custom target 'ct-resources_h' >dbg adding custom target 'cti-resources_c' >dbg adding custom target 'cti-resources_h' >dbg adding custom target 'build-resources_gresource' >dbg adding custom target 'gsettings-compileschemas' >dbg adding build target schemaprog >modules/gnome.meson:304:22: error program not found >304 | find_program('gdbus-codegen'), > ^______________ >modules/gnome.meson:304:9: error in find_program >304 | find_program('gdbus-codegen'), > ^____________________________ >modules/gnome.meson:304:9: error in gdbus_codegen >304 | find_program('gdbus-codegen'), > ^____________________________ >/var/tmp/portage/dev-build/muon-0.4.0/work/muon-v0.4.0/subprojects/meson-tests/frameworks/7 gnome/meson.build:69:1: error in subdir > 69 | subdir('gdbus') > ^______________ > > >333/350 muon:analyze / modules/i18n.meson [1;32mOK [0m 0.17s >334/350 muon:analyze / runtime/dependencies.meson [1;32mOK [0m 0.15s >[335-350/350] ð muon:project+meson-tests+requires_python / meson-tests/frameworks/6 gettext 0/30s[K335/350 muon:project+meson-tests / meson-tests/common/205 native file path override [1;32mOK [0m 4.87s >[336-350/350] ð muon:project+meson-tests+requires_python / meson-tests/frameworks/6 gettext 0/30s[K336/350 muon:project+meson-tests / meson-tests/native/8 external program shebang parsing [1;32mOK [0m 1.12s >[337-350/350] ð muon:project+meson-tests+requires_python / meson-tests/frameworks/6 gettext 0/30s[K337/350 muon:project+meson-tests / meson-tests/common/207 warning level 0 [1;32mOK [0m 4.83s >[338-350/350] ð muon:project+meson-tests+requires_python / meson-tests/frameworks/6 gettext 0/30s[K338/350 muon:project+meson-tests / meson-tests/native/9 override with exe [1;32mOK [0m 1.19s >[339-350/350] ð muon:project+meson-tests+requires_python / meson-tests/frameworks/6 gettext 0/30s[K339/350 muon:project+meson-tests+requires_python / meson-tests/native/3 pipeline [1;32mOK [0m 1.50s >[340-350/350] ð muon:project+meson-tests+requires_python / meson-tests/frameworks/6 gettext 0/30s[K340/350 muon:project+meson-tests / meson-tests/common/215 source set realistic example [1;32mOK [0m 4.62s >[341-350/350] ð muon:project+meson-tests+requires_python / meson-tests/frameworks/6 gettext 0/30s[K341/350 muon:project+meson-tests+requires_python / meson-tests/native/5 install script [1;32mOK [0m 1.50s >[342-350/350] ð muon:project+meson-tests+requires_python / meson-tests/frameworks/6 gettext 0/30s[K[342-350/350] ð muon:project+meson-tests / meson-tests/native/7 selfbuilt custom 1/30s[K342/350 muon:project+meson-tests / meson-tests/common/264 required keyword in has functions [1;32mOK [0m 2.69s >[343-350/350] ð muon:project+meson-tests / meson-tests/native/7 selfbuilt custom 1/30s[K343/350 muon:project+meson-tests+requires_python / meson-tests/frameworks/6 gettext [1;32mOK [0m 1.22s >[344-350/350] ð muon:project+meson-tests / meson-tests/native/7 selfbuilt custom 1/30s[K344/350 muon:project+meson-tests / meson-tests/common/223 persubproject options [1;32mOK [0m 4.82s >[345-350/350] ð muon:project+meson-tests / meson-tests/native/7 selfbuilt custom 1/30s[K345/350 muon:project+meson-tests / meson-tests/common/36 has function [1;32mOK [0m 13.72s >[346-350/350] ð muon:project+meson-tests / meson-tests/native/7 selfbuilt custom 1/30s[K346/350 muon:project+meson-tests / meson-tests/common/103 has header symbol [1;32mOK [0m 11.25s >[347-350/350] ð muon:project+meson-tests / meson-tests/native/7 selfbuilt custom 2/30s[K[347-350/350] ð muon:project+meson-tests / meson-tests/native/6 add language 2/30s[K347/350 muon:project+meson-tests / meson-tests/native/4 tryrun [1;32mOK [0m 3.67s >[348-350/350] ð muon:project+meson-tests / meson-tests/native/6 add language 3/30s[K348/350 muon:project+meson-tests / meson-tests/native/6 add language [1;32mOK [0m 3.58s >[349-350/350] ð muon:project+meson-tests / meson-tests/common/197 function attributes 7/30s[K[349-350/350] ð muon:project+meson-tests / meson-tests/native/7 selfbuilt custom 3/30s[K349/350 muon:project+meson-tests / meson-tests/native/7 selfbuilt custom [1;32mOK [0m 4.29s >[350/350] ð muon:project+meson-tests / meson-tests/common/197 function attributes 8/30s[K[350/350] ð muon:project+meson-tests / meson-tests/common/197 function attributes 8/30s[K[350/350] ð muon:project+meson-tests / meson-tests/common/197 function attributes 9/30s[K[350/350] ð muon:project+meson-tests / meson-tests/common/197 function attributes 10/30s[K[350/350] ð muon:project+meson-tests / meson-tests/common/197 function attributes 11/30s[K[350/350] ð muon:project+meson-tests / meson-tests/common/197 function attributes 12/30s[K[350/350] ð muon:project+meson-tests / meson-tests/common/197 function attributes 13/30s[K350/350 muon:project+meson-tests / meson-tests/common/197 function attributes [1;32mOK [0m 13.69s > >Summary of Failures: > >332/350 muon:project+meson-tests+requires_python / meson-tests/frameworks/7 gnome [1;31mFAIL [0m 0.62s exit status 1 > >Ok: 335 >Expected Fail: 4 >Fail: 1 >Unexpected Pass: 0 >Skipped: 10 >Timeout: 0 > >Full log written to /var/tmp/portage/dev-build/muon-0.4.0/work/muon-0.4.0-build/meson-logs/testlog.txt > [31;01m*[0m ERROR: dev-build/muon-0.4.0::gentoo failed (test phase): > [31;01m*[0m tests failed > [31;01m*[0m > [31;01m*[0m Call stack: > [31;01m*[0m ebuild.sh, line 136: Called src_test > [31;01m*[0m environment, line 2515: Called meson_src_test > [31;01m*[0m environment, line 1785: Called die > [31;01m*[0m The specific snippet of code: > [31;01m*[0m [[ ${rv} -eq 0 ]] || die -n "tests failed"; > [31;01m*[0m > [31;01m*[0m If you need support, post the output of `emerge --info '=dev-build/muon-0.4.0::gentoo'`, > [31;01m*[0m the complete build log and the output of `emerge -pqv '=dev-build/muon-0.4.0::gentoo'`. > [31;01m*[0m The complete build log is located at '/var/tmp/portage/dev-build/muon-0.4.0/temp/build.log'. > [31;01m*[0m The ebuild environment file is located at '/var/tmp/portage/dev-build/muon-0.4.0/temp/environment'. > [31;01m*[0m Working directory: '/var/tmp/portage/dev-build/muon-0.4.0/work/muon-0.4.0-build' > [31;01m*[0m S: '/var/tmp/portage/dev-build/muon-0.4.0/work/muon-v0.4.0'
You cannot view the attachment while viewing its details because your browser does not support IFRAMEs.
View the attachment on a separate page
.
View Attachment As Raw
Actions:
View
Attachments on
bug 950568
: 920191 |
920192