Created attachment 922993 [details] build.log (ppc64, 3.24.0_p1) [...] powerpc64-unknown-linux-musl-gcc -DHAVE_CONFIG_H -I. -I.. -I.. -I../include -I../include -I../VEX/pub -I../VEX/pub -DVGA_ppc64be=1 -DVGO_linux=1 -DVGP_ppc64be_linux=1 -DVGPV_ppc64be_linux_vanilla=1 -m64 -O2 -g -Wall -Wmissing-protot$ ../coregrind/link_tool_exe_linux 0x58000000 powerpc64-unknown-linux-musl-gcc -Os -pipe -mcpu=970 -mtune=970 -maltivec -mabi=altivec -fno-stack-protector -fno-harden-control-flow-redundancy -Wl,-O1 -Wl,--as-needed -Wl,-z,pack-relative-$ /usr/lib/gcc/powerpc64-unknown-linux-musl/14/../../../../powerpc64-unknown-linux-musl/bin/ld: ../coregrind/libcoregrind-ppc64be-linux.a(libcoregrind_ppc64be_linux_a-m_signals.o) .opd not allowed in ABI version 2 /usr/lib/gcc/powerpc64-unknown-linux-musl/14/../../../../powerpc64-unknown-linux-musl/bin/ld: ../coregrind/libcoregrind-ppc64be-linux.a: error adding symbols: bad value collect2: error: ld returned 1 exit status make[3]: *** [Makefile:1160: memcheck-ppc64be-linux] Error 1 make[3]: Leaving directory '/var/tmp/portage/dev-debug/valgrind-3.24.0_p1/work/valgrind-3.24.0/memcheck' make[2]: *** [Makefile:1471: all-recursive] Error 1 make[2]: Leaving directory '/var/tmp/portage/dev-debug/valgrind-3.24.0_p1/work/valgrind-3.24.0/memcheck' make[1]: *** [Makefile:925: all-recursive] Error 1 make[1]: Leaving directory '/var/tmp/portage/dev-debug/valgrind-3.24.0_p1/work/valgrind-3.24.0' make: *** [Makefile:788: all] Error 2 * ERROR: dev-debug/valgrind-3.24.0_p1::gentoo failed (compile phase):
Created attachment 922994 [details] emerge --info