Gentoo Websites Logo
Go to: Gentoo Home Documentation Forums Lists Bugs Planet Store Wiki Get Gentoo!
Bug 951727 - net-irc/weechat-4.5.2 fails test - [gcc-15] 1 - unit (Failed) (tests/scripts/test-scripts.cpp:284: error: Failure in TEST(Scripts, API))
Summary: net-irc/weechat-4.5.2 fails test - [gcc-15] 1 - unit (Failed) (tests/scripts/...
Status: CONFIRMED
Alias: None
Product: Gentoo Linux
Classification: Unclassified
Component: Current packages (show other bugs)
Hardware: All Linux
: Normal normal
Assignee: Zoltan Puskas
URL:
Whiteboard:
Keywords: TESTFAILURE
Depends on:
Blocks:
 
Reported: 2025-03-21 20:03 UTC by Toralf Förster
Modified: 2025-03-22 04:48 UTC (History)
1 user (show)

See Also:
Package list:
Runtime testing required: ---


Attachments
emerge-info.txt (emerge-info.txt,19.02 KB, text/plain)
2025-03-21 20:03 UTC, Toralf Förster
Details
LastTest.log (LastTest.log,77.88 KB, text/plain)
2025-03-21 20:03 UTC, Toralf Förster
Details
emerge-history.txt (emerge-history.txt,174.45 KB, text/plain)
2025-03-21 20:04 UTC, Toralf Förster
Details
environment (environment,161.20 KB, text/plain)
2025-03-21 20:04 UTC, Toralf Förster
Details
etc.clang.tar.xz (etc.clang.tar.xz,1.21 KB, application/x-xz)
2025-03-21 20:04 UTC, Toralf Förster
Details
etc.portage.tar.xz (etc.portage.tar.xz,25.12 KB, application/x-xz)
2025-03-21 20:04 UTC, Toralf Förster
Details
logs.tar.xz (logs.tar.xz,46.76 KB, application/x-xz)
2025-03-21 20:04 UTC, Toralf Förster
Details
net-irc:weechat-4.5.2:20250321-194707.log.xz (net-irc:weechat-4.5.2:20250321-194707.log.xz,26.02 KB, application/x-xz)
2025-03-21 20:04 UTC, Toralf Förster
Details
qlist-info.txt.xz (qlist-info.txt.xz,47.42 KB, application/x-xz)
2025-03-21 20:04 UTC, Toralf Förster
Details
temp.tar.xz (temp.tar.xz,33.48 KB, application/x-xz)
2025-03-21 20:04 UTC, Toralf Förster
Details

Note You need to log in before you can comment on or make changes to this bug.
Description Toralf Förster gentoo-dev 2025-03-21 20:03:55 UTC
0% tests passed, 1 tests failed out of 1

Total Test time (real) =   1.49 sec

The following tests FAILED:
	  1 - unit (Failed)
Errors while running CTest
Output from these tests are in: /var/tmp/portage/net-irc/weechat-4.5.2/work/weechat-4.5.2_build/Testing/Temporary/LastTest.log

  -------------------------------------------------------------------

  This is an unstable amd64 chroot image at a tinderbox (==build bot)
  name: 23.0_no_multilib_systemd_test-20250316-231002

  KEYWORDED/UNMASKED

  [gcc-15] Requested by sam
  <sys-devel/gcc-15.0.9999:15

  The attached etc.portage.tar.xz has all details.
  -------------------------------------------------------------------

gcc-config -l:
 [1] x86_64-pc-linux-gnu-15 *
clang version 20.1.0
llvm-config: 20.1.0
Python 3.12.9
go version go1.24.1 linux/amd64
  [1]   php8.2
  [2]   php8.4 *
Available Ruby profiles:
  [1]   ruby32 (with Rubygems)
  [2]   ruby34 (with Rubygems) *
Available Rust versions:
  [1]   rust-bin-1.85.0
  [2]   rust-bin-1.85.1
  [3]   rust-1.85.1 *
The following VMs are available for generation-2:
*)	Eclipse Temurin JDK 21.0.6_p7 [openjdk-bin-21]
2)	Eclipse Temurin JDK 8.442_p06 [openjdk-bin-8]
Available Java Virtual Machines:
  [1]   openjdk-bin-8 
  [2]   openjdk-bin-21  system-vm


  HEAD of ::gentoo
commit ffb99fcb17d3d838d3df01fe100c07b372c84829
Author: Repository mirror & CI <repomirrorci@gentoo.org>
Date:   Fri Mar 21 19:20:21 2025 +0000

    2025-03-21 19:20:21 UTC

emerge -qpvO =net-irc/weechat-4.5.2
[ebuild  N    ] net-irc/weechat-4.5.2  USE="alias buflist charset exec fifo fset irc logger nls perl relay scripts spell test trigger typing xfer zstd -doc -enchant -guile -lua -man -python -relay-api -ruby (-selinux) -tcl -verify-sig" GUILE_SINGLE_TARGET="3-0 -2-2" LUA_SINGLE_TARGET="lua5-1 -lua5-3 -lua5-4" PYTHON_SINGLE_TARGET="python3_12 -python3_10 -python3_11 -python3_13"
Comment 1 Toralf Förster gentoo-dev 2025-03-21 20:03:57 UTC
Created attachment 921601 [details]
emerge-info.txt
Comment 2 Toralf Förster gentoo-dev 2025-03-21 20:03:58 UTC
Created attachment 921602 [details]
LastTest.log
Comment 3 Toralf Förster gentoo-dev 2025-03-21 20:04:01 UTC
Created attachment 921603 [details]
emerge-history.txt
Comment 4 Toralf Förster gentoo-dev 2025-03-21 20:04:02 UTC
Created attachment 921604 [details]
environment
Comment 5 Toralf Förster gentoo-dev 2025-03-21 20:04:03 UTC
Created attachment 921605 [details]
etc.clang.tar.xz
Comment 6 Toralf Förster gentoo-dev 2025-03-21 20:04:04 UTC
Created attachment 921606 [details]
etc.portage.tar.xz
Comment 7 Toralf Förster gentoo-dev 2025-03-21 20:04:05 UTC
Created attachment 921607 [details]
logs.tar.xz
Comment 8 Toralf Förster gentoo-dev 2025-03-21 20:04:06 UTC
Created attachment 921608 [details]
net-irc:weechat-4.5.2:20250321-194707.log.xz
Comment 9 Toralf Förster gentoo-dev 2025-03-21 20:04:08 UTC
Created attachment 921609 [details]
qlist-info.txt.xz
Comment 10 Toralf Förster gentoo-dev 2025-03-21 20:04:09 UTC
Created attachment 921610 [details]
temp.tar.xz
Comment 11 Toralf Förster gentoo-dev 2025-03-21 20:04:10 UTC
The file size of ./files/tests.tar.xz is too big (3.0M) for an upload. For few weeks the link http://tinderbox.zwiebeltoralf.de:31560/23.0_no_multilib_systemd_test-20250316-231002/var/tmp/tb/issues/20250321-194843-net-irc_weechat-4.5.2/files/tests.tar.xz is valid.
Comment 12 Sam James archtester Gentoo Infrastructure gentoo-dev Security 2025-03-22 04:48:16 UTC
```
/var/tmp/portage/net-irc/weechat-4.5.2/work/weechat-4.5.2/tests/scripts/test-scripts.cpp:284: error: Failure in TEST(Scripts, API)
	CHECK(api_tests_count > 0) failed

 - 1 ms
```