Gentoo Websites Logo
Go to: Gentoo Home Documentation Forums Lists Bugs Planet Store Wiki Get Gentoo!
Bug 951575 - dev-python/sphinx-8.2.3 - fails test_graphviz_latex, test_inheritance_diagram_latex on ppc/ppc64
Summary: dev-python/sphinx-8.2.3 - fails test_graphviz_latex, test_inheritance_diagram...
Status: UNCONFIRMED
Alias: None
Product: Gentoo Linux
Classification: Unclassified
Component: Current packages (show other bugs)
Hardware: PPC64 Linux
: Normal normal
Assignee: Python Gentoo Team
URL:
Whiteboard:
Keywords: TESTFAILURE
Depends on:
Blocks:
 
Reported: 2025-03-18 23:20 UTC by ernsteiswuerfel
Modified: 2025-03-18 23:26 UTC (History)
1 user (show)

See Also:
Package list:
Runtime testing required: ---


Attachments
build.log (ppc64, 8.2.3) (sphinx-8.2.3:20250318-162608.log,459.32 KB, text/plain)
2025-03-18 23:20 UTC, ernsteiswuerfel
Details
build.log.xz (ppc64, 8.1.3) (sphinx-8.1.3:20250318-174059.log.xz,44.77 KB, application/x-xz)
2025-03-18 23:21 UTC, ernsteiswuerfel
Details
emerge --info (file_951575.txt,6.68 KB, text/plain)
2025-03-18 23:22 UTC, ernsteiswuerfel
Details
build.log (ppc, 8.2.3) (sphinx-8.2.3:20250318-212029.log,464.77 KB, text/plain)
2025-03-18 23:26 UTC, ernsteiswuerfel
Details
build.log.xz (ppc, 8.1.3) (sphinx-8.1.3:20250318-210655.log.xz,44.83 KB, application/x-xz)
2025-03-18 23:26 UTC, ernsteiswuerfel
Details

Note You need to log in before you can comment on or make changes to this bug.
Description ernsteiswuerfel archtester 2025-03-18 23:20:18 UTC
Created attachment 921207 [details]
build.log (ppc64, 8.2.3)

[...]
FAILED tests/test_extensions/test_ext_graphviz.py::test_graphviz_latex - assert None
 +  where None = <function search at 0x3fffad9eccc0>('\\\\begin{figure}\\[htbp\\]\n\\\\centering\n\\\\capstart\n\n\\\\sphinxincludegraphics\\[\\]{graphviz-\\w+.pdf}\n\\\\caption{caption of graph}\\\\label{.*}\\\\end{figure}', '%% Genera$
 +    where <function search at 0x3fffad9eccc0> = re.search
 +    and   re.DOTALL = re.DOTALL
FAILED tests/test_extensions/test_ext_inheritance_diagram.py::test_inheritance_diagram_latex - assert None
 +  where None = <function search at 0x3fffad9eccc0>('\\\\begin{figure}\\[htbp]\n\\\\centering\n\\\\capstart\n\n\\\\sphinxincludegraphics\\[\\]{inheritance-\\w+.pdf}\n\\\\caption{Test Foo!}\\\\label{\\\\detokenize{index:id1}}\\\\end{fig$
 +    where <function search at 0x3fffad9eccc0> = re.search
 +    and   re.MULTILINE = re.MULTILINE
= 2 failed, 2315 passed, 10 skipped, 8 deselected, 5 warnings, 10 rerun in 619.85s (0:10:19) ==
 * ERROR: dev-python/sphinx-8.2.3::gentoo failed (test phase):
 *   pytest failed with python3.12


No regression over previous stable 8.1.3 (10 failed, 2251 passed) on ppc64.
Comment 1 ernsteiswuerfel archtester 2025-03-18 23:21:36 UTC
Created attachment 921208 [details]
build.log.xz (ppc64, 8.1.3)
Comment 2 ernsteiswuerfel archtester 2025-03-18 23:22:03 UTC
Created attachment 921209 [details]
emerge --info
Comment 3 ernsteiswuerfel archtester 2025-03-18 23:25:28 UTC
Same on ppc.
Comment 4 ernsteiswuerfel archtester 2025-03-18 23:26:21 UTC
Created attachment 921210 [details]
build.log (ppc, 8.2.3)
Comment 5 ernsteiswuerfel archtester 2025-03-18 23:26:44 UTC
Created attachment 921211 [details]
build.log.xz (ppc, 8.1.3)