Created attachment 921052 [details] build.log (ppc, 2.7.1) [...] 22: test 22 (fulltable numeric=1 ts=FULL_TABLE) FAILED (libkeymap.at:126) ## ------------- ## ## Test results. ## ## ------------- ## ERROR: 36 tests were run, 1 failed unexpectedly. 4 tests were skipped. ## -------------------------- ## ## testsuite.log was created. ## ## -------------------------- ## Please send 'tests/testsuite.log' and all information you think might help: To: <gladkov.alexey@gmail.com> Subject: [kbd 2.7.1] testsuite: 22 failed You may investigate any problem if you feel able to do so, in which case the test suite provides a good starting point. Its output may be found below 'tests/testsuite.dir'. make[3]: *** [Makefile:746: check-local] Error 1 make[3]: Leaving directory '/var/tmp/portage/sys-apps/kbd-2.7.1/work/kbd-2.7.1/tests' make[2]: *** [Makefile:604: check-am] Error 2 make[2]: Leaving directory '/var/tmp/portage/sys-apps/kbd-2.7.1/work/kbd-2.7.1/tests' make[1]: *** [Makefile:454: check-recursive] Error 1 make[1]: Leaving directory '/var/tmp/portage/sys-apps/kbd-2.7.1/work/kbd-2.7.1/tests' make: *** [Makefile:511: check-recursive] Error 1 * ERROR: sys-apps/kbd-2.7.1::gentoo failed (test phase): * emake failed Probably something different than bug #727822 as 2.6.4 passes testsuite.
Created attachment 921053 [details] build.log (ppc, 2.6.4)
Created attachment 921054 [details] emerge --info
Ah, this has already been reported upstream.
Created attachment 921055 [details, diff] Fix tests on powerpc Fixed by upstream commit https://github.com/legionus/kbd/commit/fdc2eb6efe30429ce61238792e8c628157607ab6