Gentoo Websites Logo
Go to: Gentoo Home Documentation Forums Lists Bugs Planet Store Wiki Get Gentoo!
Bug 950288 - sys-libs/pam-1.7.0_p20241230-r3 FAILED doc/sag/Linux-PAM_SAG.pdf doc/adg/Linux-PAM_ADG.pdf
Summary: sys-libs/pam-1.7.0_p20241230-r3 FAILED doc/sag/Linux-PAM_SAG.pdf doc/adg/Linu...
Status: UNCONFIRMED
Alias: None
Product: Gentoo Linux
Classification: Unclassified
Component: Current packages (show other bugs)
Hardware: All Linux
: Normal normal
Assignee: Gentoo's Team for Core System packages
URL:
Whiteboard:
Keywords:
Depends on:
Blocks:
 
Reported: 2025-02-25 20:08 UTC by Bob Johnson
Modified: 2025-02-26 16:35 UTC (History)
3 users (show)

See Also:
Package list:
Runtime testing required: ---


Attachments
Build log (sys-libs:pam-1.7.0_p20241230-r3:20250225-195035.log,603.83 KB, text/plain)
2025-02-25 20:09 UTC, Bob Johnson
Details

Note You need to log in before you can comment on or make changes to this bug.
Description Bob Johnson 2025-02-25 20:08:00 UTC
Even though sys-libs/pam has no doc USE flag it appears to be trying to compile documentation and fails. I tried turning off the examples USE flag and it still fails with the same error.

Reproducible: Always




# emerge --info sys-libs/pam
Portage 3.0.66.1 (python 3.12.9-final-0, default/linux/amd64/23.0/desktop/plasma, gcc-14, glibc-2.40-r8, 6.6.74-gentoo x86_64)
=================================================================
                         System Settings
=================================================================
System uname: Linux-6.6.74-gentoo-x86_64-AMD_Ryzen_9_3950X_16-Core_Processor-with-glibc2.40
KiB Mem:    65788132 total,  50884328 free
KiB Swap:   33554428 total,  33554428 free
Timestamp of repository gentoo: Tue, 25 Feb 2025 17:15:00 +0000
Head commit of repository gentoo: 8eccbe3102ffc99bcbdea9545cb56f13e00efc6b
sh bash 5.2_p37
ld GNU ld (Gentoo 2.43 p3) 2.43.1
app-misc/pax-utils:        1.3.8::gentoo
app-shells/bash:           5.2_p37::gentoo
dev-build/autoconf:        2.13-r8::gentoo, 2.72-r1::gentoo
dev-build/automake:        1.16.5-r2::gentoo
dev-build/cmake:           3.31.5::gentoo
dev-build/libtool:         2.5.4::gentoo
dev-build/make:            4.4.1-r100::gentoo
dev-build/meson:           1.6.1::gentoo
dev-java/java-config:      2.3.4::gentoo
dev-lang/perl:             5.40.0-r1::gentoo
dev-lang/python:           3.11.11_p1::gentoo, 3.12.9::gentoo, 3.13.2::gentoo
dev-lang/rust:             1.84.1-r1::gentoo
llvm-core/clang:           18.1.8-r6::gentoo, 19.1.7::gentoo
llvm-core/lld:             19.1.7::gentoo
llvm-core/llvm:            18.1.8-r6::gentoo, 19.1.7::gentoo
sys-apps/baselayout:       2.17::gentoo
sys-apps/openrc:           0.55.1::gentoo
sys-apps/sandbox:          2.39::gentoo
sys-devel/binutils:        2.43-r2::gentoo
sys-devel/binutils-config: 5.5.2::gentoo
sys-devel/gcc:             14.2.1_p20241221::gentoo
sys-devel/gcc-config:      2.12.1::gentoo
sys-kernel/linux-headers:  6.12::gentoo (virtual/os-headers)
sys-libs/glibc:            2.40-r8::gentoo
Repositories:

gentoo
    location: /var/db/repos/gentoo
    sync-type: rsync
    sync-uri: rsync://rsync.namerica.gentoo.org/gentoo-portage/
    priority: -1000
    volatile: False
    sync-rsync-extra-opts: 
    sync-rsync-verify-metamanifest: yes
    sync-rsync-verify-jobs: 1
    sync-rsync-verify-max-age: 24

local
    location: /usr/local/portage
    masters: gentoo
    volatile: True

ACCEPT_KEYWORDS="amd64"
ACCEPT_LICENSE="@FREE"
CBUILD="x86_64-pc-linux-gnu"
CFLAGS="-march=native -O2 -pipe"
CHOST="x86_64-pc-linux-gnu"
CONFIG_PROTECT="/etc /usr/lib64/libreoffice/program/sofficerc /usr/share/config /usr/share/easy-rsa /usr/share/gnupg/qualified.txt /usr/share/themes/oxygen-gtk/gtk-2.0 /var/bind"
CONFIG_PROTECT_MASK="/etc/ca-certificates.conf /etc/dconf /etc/env.d /etc/fonts/fonts.conf /etc/gconf /etc/gentoo-release /etc/php/apache2-php8.2/ext-active/ /etc/php/cgi-php8.2/ext-active/ /etc/php/cli-php8.2/ext-active/ /etc/php/fpm-php8.2/ext-active/ /etc/php/phpdbg-php8.2/ext-active/ /etc/revdep-rebuild /etc/sandbox.d /etc/texmf/language.dat.d /etc/texmf/language.def.d /etc/texmf/updmap.d /etc/texmf/web2c"
CXXFLAGS="-march=native -O2 -pipe"
DISTDIR="/var/cache/distfiles"
EMERGE_DEFAULT_OPTS="--jobs=8 --load-average=32"
ENV_UNSET="CARGO_HOME DBUS_SESSION_BUS_ADDRESS DISPLAY GDK_PIXBUF_MODULE_FILE GOBIN GOPATH PERL5LIB PERL5OPT PERLPREFIX PERL_CORE PERL_MB_OPT PERL_MM_OPT XAUTHORITY XDG_CACHE_HOME XDG_CONFIG_HOME XDG_DATA_HOME XDG_RUNTIME_DIR XDG_STATE_HOME"
FCFLAGS="-march=native -O2 -pipe"
FEATURES="assume-digests binpkg-docompress binpkg-dostrip binpkg-logs buildpkg-live config-protect-if-modified distlocks ebuild-locks fixlafiles ipc-sandbox merge-sync merge-wait multilib-strict network-sandbox news parallel-fetch parallel-install pid-sandbox pkgdir-index-trusted preserve-libs protect-owned qa-unresolved-soname-deps sandbox sfperms strict unknown-features-warn unmerge-logs unmerge-orphans userfetch userpriv usersandbox usersync xattr"
FFLAGS="-march=native -O2 -pipe"
GENTOO_MIRRORS="http://distfiles.gentoo.org"
LANG="en_US.utf8"
LDFLAGS="-Wl,-O1 -Wl,--as-needed -Wl,-z,pack-relative-relocs"
LEX="flex"
LINGUAS="en en_US"
MAKEOPTS="--jobs=32 --load-average=35"
PKGDIR="/var/cache/binpkgs"
PORTAGE_CONFIGROOT="/"
PORTAGE_RSYNC_OPTS="--recursive --links --safe-links --perms --times --omit-dir-times --compress --force --whole-file --delete --stats --human-readable --timeout=180 --exclude=/distfiles --exclude=/local --exclude=/packages --exclude=/.git"
PORTAGE_TMPDIR="/var/tmp"
SHELL="/bin/bash"
USE="X a52 aac acl acpi activities alsa amd64 bluetooth branding bzip2 cairo cdda cdr cet colord crypt cups dbus declarative doc dri dts dvd dvdr elogind encode examples exif flac fontconfig fortran gdbm gif gtk gtk-doc gui handbook iconv icu ipv6 jack java jbig jpeg kde kf6compat kwallet lcms libnotify libtirpc lzma mad mbox mng mp3 mp4 mpeg multilib ncurses nls nptl odbc ogg openexr opengl openmp pam pango pcre pdf pipewire plasma png policykit postgres ppds pulseaudio qml qt5 qt6 readline screencast sdl seccomp semantic-desktop sound source spell ssl startup-notification svg test-rust threads tiff truetype udev udisks unicode upower usb vim-syntax vorbis vulkan wayland webp widgets wxwidgets x264 xattr xcb xft xinerama xml xpm xv xvid zlib" ABI_X86="64 32" ADA_TARGET="gcc_14" AMDGPU_TARGETS="gfx1012" APACHE2_MODULES="actions alias auth_basic auth_digest authn_anon authn_core authn_dbd authn_dbm authn_default authn_file authz_core authz_dbm authz_default authz_groupfile authz_host authz_owner authz_user autoindex cache cgid dav dav_fs dav_lock dbd deflate dir disk_cache env expires ext_filter file_cache filter headers http2 ident imagemap include info lbmethod_byrequests log_config log_forensic logio mem_cache mime mime_magic negotiation proxy proxy_ajp proxy_balancer proxy_connect proxy_http proxy_http2 rewrite setenvif slotmem_shm socache_shmcb speling status unique_id unixd userdir usertrack vhost_alias" APACHE2_MPMS="worker" CALLIGRA_FEATURES="karbon sheets words" CAMERAS="canon" COLLECTD_PLUGINS="df interface irq load memory rrdtool swap syslog" CPU_FLAGS_X86="aes avx avx2 f16c fma3 mmx mmxext pclmul popcnt rdrand sha sse sse2 sse3 sse4_1 sse4_2 sse4a ssse3" ELIBC="glibc" GPSD_PROTOCOLS="ashtech aivdm earthmate evermore fv18 garmin garmintxt gpsclock greis isync itrax navcom oceanserver oncore rtcm104v2 rtcm104v3 sirf skytraq superstar2 tsip tripmate tnt ublox" GRUB_PLATFORMS="efi-64" GUILE_SINGLE_TARGET="3-0" GUILE_TARGETS="3-0" INPUT_DEVICES="libinput wacom joystick" KERNEL="linux" L10N="en en-US" LCD_DEVICES="bayrad cfontz glk hd44780 lb216 lcdm001 mtxorb text" LIBREOFFICE_EXTENSIONS="nlpsolver wiki-publisher" LUA_SINGLE_TARGET="lua5-1" LUA_TARGETS="lua5-1" OFFICE_IMPLEMENTATION="libreoffice" PHP_TARGETS="php8-2" POSTGRES_TARGETS="postgres16" PYTHON_SINGLE_TARGET="python3_12" PYTHON_TARGETS="python3_12" RUBY_TARGETS="ruby32" SANE_BACKENDS="epson2" VIDEO_CARDS="amdgpu radeonsi fbdev vesa" XTABLES_ADDONS="quota2 psd pknock lscan length2 ipv4options ipp2p iface geoip fuzzy condition tarpit sysrq proto logmark ipmark dhcpmac delude chaos account"
Unset:  ADDR2LINE, AR, ARFLAGS, AS, ASFLAGS, CC, CCLD, CONFIG_SHELL, CPP, CPPFLAGS, CTARGET, CXX, CXXFILT, ELFEDIT, EXTRA_ECONF, F77FLAGS, FC, GCOV, GPROF, INSTALL_MASK, LC_ALL, LD, LFLAGS, LIBTOOL, MAKE, MAKEFLAGS, NM, OBJCOPY, OBJDUMP, PORTAGE_BINHOST, PORTAGE_BUNZIP2_COMMAND, PORTAGE_COMPRESS, PORTAGE_COMPRESS_FLAGS, PORTAGE_RSYNC_EXTRA_OPTS, PYTHONPATH, RANLIB, READELF, RUSTFLAGS, SIZE, STRINGS, STRIP, YACC, YFLAGS

=================================================================
                        Package Settings
=================================================================

sys-libs/pam-1.6.1::gentoo was built with the following:
USE="examples filecaps -audit -berkdb -debug -nis (-selinux)" ABI_X86="32 (64) (-x32)"

# emerge -pv pam

These are the packages that would be merged, in order:

Calculating dependencies... done!
Dependency resolution took 13.32 s (backtrack: 0/20).

[ebuild     U  ] sys-libs/pam-1.7.0_p20241230-r3::gentoo [1.6.1::gentoo] USE="elogind%* examples filecaps nls%* -audit -berkdb -debug -nis (-selinux) -systemd%" ABI_X86="32 (64) (-x32)" 0 KiB

Total: 1 package (1 upgrade), Size of downloads: 0 KiB
Comment 1 Bob Johnson 2025-02-25 20:09:11 UTC
Created attachment 919915 [details]
Build log
Comment 2 Sam James archtester Gentoo Infrastructure gentoo-dev Security 2025-02-25 20:12:38 UTC
```
[539/542] /usr/bin/fop doc/mwg/Linux-PAM_MWG.fop doc/mwg/Linux-PAM_MWG.pdf
FAILED: doc/mwg/Linux-PAM_MWG.pdf 
/usr/bin/fop doc/mwg/Linux-PAM_MWG.fop doc/mwg/Linux-PAM_MWG.pdf
Exception in thread "main" java.lang.NoSuchMethodError: java.nio.ByteBuffer.clear()Ljava/nio/ByteBuffer;
	at org.apache.logging.log4j.core.appender.OutputStreamManager.flushBuffer(OutputStreamManager.java:286)
	at org.apache.logging.log4j.core.appender.OutputStreamManager.flush(OutputStreamManager.java:294)
	at org.apache.logging.log4j.core.appender.OutputStreamManager.closeOutputStream(OutputStreamManager.java:299)
	at org.apache.logging.log4j.core.appender.OutputStreamManager.releaseSub(OutputStreamManager.java:122)
	at org.apache.logging.log4j.core.appender.AbstractManager.stop(AbstractManager.java:117)
	at org.apache.logging.log4j.core.appender.AbstractOutputStreamAppender.stop(AbstractOutputStreamAppender.java:180)
	at org.apache.logging.log4j.core.appender.AbstractOutputStreamAppender.stop(AbstractOutputStreamAppender.java:174)
	at org.apache.logging.log4j.core.config.AbstractConfiguration.stop(AbstractConfiguration.java:414)
	at org.apache.logging.log4j.core.AbstractLifeCycle.stop(AbstractLifeCycle.java:136)
	at org.apache.logging.log4j.core.LoggerContext.setConfiguration(LoggerContext.java:626)
	at org.apache.logging.log4j.core.LoggerContext.reconfigure(LoggerContext.java:694)
	at org.apache.logging.log4j.core.LoggerContext.reconfigure(LoggerContext.java:711)
	at org.apache.logging.log4j.core.LoggerContext.start(LoggerContext.java:253)
	at org.apache.logging.log4j.core.impl.Log4jContextFactory.getContext(Log4jContextFactory.java:155)
	at org.apache.logging.log4j.core.impl.Log4jContextFactory.getContext(Log4jContextFactory.java:47)
	at org.apache.logging.log4j.LogManager.getContext(LogManager.java:196)
	at org.apache.logging.log4j.spi.AbstractLoggerAdapter.getContext(AbstractLoggerAdapter.java:137)
	at org.apache.commons.logging.impl.Log4jApiLogFactory$LogAdapter.getContext(Log4jApiLogFactory.java:161)
	at org.apache.logging.log4j.spi.AbstractLoggerAdapter.getLogger(AbstractLoggerAdapter.java:47)
	at org.apache.commons.logging.impl.Log4jApiLogFactory.getInstance(Log4jApiLogFactory.java:210)
	at org.apache.commons.logging.LogFactory.getLog(LogFactory.java:933)
	at org.apache.fop.cli.CommandLineOptions.<init>(CommandLineOptions.java:153)
	at org.apache.fop.cli.Main.startFOP(Main.java:162)
	at org.apache.fop.cli.Main.startFOP(Main.java:142)
	at org.apache.fop.cli.Main.main(Main.java:211)
```
Comment 3 Bob Johnson 2025-02-26 05:25:41 UTC
OK, progress. On my system I have two JVMs:

# eselect java-vm list
Available Java Virtual Machines:
  [1]   openjdk-bin-8 
  [2]   openjdk-bin-21  system-vm

Apparently jdk:1.8 is still required by app-emulation/virtualbox, and that's what my system-vm was set to. When I eselect my java system-vm to jdk:21 sys-libs/pam-1.7.0_p20241230-r3 compiles fine. I tracked this down by referencing this page:

https://www.morling.dev/blog/bytebuffer-and-the-dreaded-nosuchmethoderror/

I don't know enough about java to say if this is a code bug, a build system bug, or user error caused by my clinging to an old jvm. The bug wranglers can dispose of this "bug" as they see fit.