Gentoo Websites Logo
Go to: Gentoo Home Documentation Forums Lists Bugs Planet Store Wiki Get Gentoo!
Bug 947406 - dev-python/docutils-0.21.2 fails tests: FAIL: test_publish (test_writers.test_html5_polyglot_parts.Html5WriterPublishPartsTestCase) (id=totest[system_messages-PIL][0])
Summary: dev-python/docutils-0.21.2 fails tests: FAIL: test_publish (test_writers.test...
Status: CONFIRMED
Alias: None
Product: Gentoo Linux
Classification: Unclassified
Component: Current packages (show other bugs)
Hardware: All Linux
: Normal normal
Assignee: Python Gentoo Team
URL:
Whiteboard:
Keywords: TESTFAILURE
Depends on:
Blocks:
 
Reported: 2025-01-03 18:02 UTC by Agostino Sarubbo
Modified: 2025-01-20 22:37 UTC (History)
1 user (show)

See Also:
Package list:
Runtime testing required: ---


Attachments
build.log (build.log,62.72 KB, text/plain)
2025-01-03 18:02 UTC, Agostino Sarubbo
Details

Note You need to log in before you can comment on or make changes to this bug.
Description Agostino Sarubbo gentoo-dev 2025-01-03 18:02:16 UTC
https://blogs.gentoo.org/ago/2020/07/04/gentoo-tinderbox/

Issue: dev-python/docutils-0.21.2 fails tests.
Discovered on: amd64 (internal ref: gcc15_tinderbox)
System: GCC-15-SYSTEM (https://wiki.gentoo.org/wiki/Project:Tinderbox/Common_Issues_Helper#GCC-15)

Info about the issue:
https://wiki.gentoo.org/wiki/Project:Tinderbox/Common_Issues_Helper#CF0015
Comment 1 Agostino Sarubbo gentoo-dev 2025-01-03 18:02:17 UTC
Created attachment 915771 [details]
build.log

build log and emerge --info
Comment 2 Agostino Sarubbo gentoo-dev 2025-01-03 18:02:17 UTC
Error(s) that match a know pattern in addition to what has been reported in the summary:


               "  [Errno 2] No such file or directory: 'dummy.png'</p>
"
'}
'} != {'fra[318 chars]y: \'dummy.png\'</p>
+              "  [Errno 2] No such file or directory: 'dummy.png'</p>
-              '  [Errno 2] No such file or directory: '
</aside>
<aside class="[253 chars]>
AssertionError: {'fra[318 chars]y: \'/var/tmp/portage/dev-python/docutils-0.21[323 chars]>
FAIL: test_publish (test_writers.test_html5_polyglot_parts.Html5WriterPublishPartsTestCase) (id="totest['system_messages-PIL'][0]")
FAILED (failures=1, skipped=3)