too long lines were shrinked: rdlibtool: lconf: found "/var/tmp/portage/sys-apps/fwts-24.03.00/work/fwts-24.03.00/libtool". rdlibtool: compile: x86_64-pc-linux-musl-gcc -I. -I../../.. -I../../../src/lib/include -I../../../src/libfwtsiasl -I../../../src/acpica/source/include -I../../../src/acpica/source/compiler -I/usr/lib/libffi/include -I/usr/include/glib-2.0 -I/usr/lib/glib-2.0/include -I/usr/include/libmount -I/usr/in fwts_backtrace.c:19:10: fatal error: execinfo.h: No such file or directory 19 | #include <execinfo.h> | ^~~~~~~~~~~~ compilation terminated. rdlibtool: error logged in slbt_exec_compile(), line 253: flow error: unexpected condition or other. make[4]: *** [Makefile:817: libfwts_la-fwts_backtrace.lo] Error 2 make[4]: Leaving directory '/var/tmp/portage/sys-apps/fwts-24.03.00/work/fwts-24.03.00/src/lib/src' ------------------------------------------------------------------- This is an unstable amd64 chroot image at a tinderbox (==build bot) name: 23.0_musl_hardened-20240906-211007 UNMASKED: Please re-assign to toolchain@ if you get a test failure in C, C++, or Fortran code which makes no sense. /etc/portage/package.unmask/60gcc:<sys-devel/gcc-15.0.9999:15 The attached etc.portage.tar.xz has all details. ------------------------------------------------------------------- gcc-config -l: [1] x86_64-pc-linux-musl-15 * clang/llvm (if any): clang version 18.1.8 Target: x86_64-pc-linux-musl Thread model: posix InstalledDir: /usr/lib/llvm/18/bin Configuration file: /etc/clang/x86_64-pc-linux-musl-clang.cfg /usr/lib/llvm/18 18.1.8 Python 3.12.6 Available Ruby profiles: (none found) Available Rust versions: [1] rust-bin-1.80.1 * The following VMs are available for generation-2: 1) Eclipse Temurin JDK 11.0.24_p8 [openjdk-bin-11] 2) Eclipse Temurin JDK 17.0.12_p7 [openjdk-bin-17] *) Eclipse Temurin JDK 21.0.4_p7 [openjdk-bin-21] Available Java Virtual Machines: [1] openjdk-bin-11 [2] openjdk-bin-17 [3] openjdk-bin-21 system-vm php cli (if any): go version go1.23.0 linux/amd64 HEAD of ::gentoo commit 718bb0f6f605a9fc442d95f11c321e6caa6b5738 Author: Repository mirror & CI <repomirrorci@gentoo.org> Date: Sun Sep 8 19:08:16 2024 +0000 2024-09-08 19:08:15 UTC emerge -qpvO =sys-apps/fwts-24.03.00 [ebuild N ] sys-apps/fwts-24.03.00
Created attachment 902426 [details] emerge-info.txt
Created attachment 902427 [details] emerge-history.txt
Created attachment 902428 [details] environment
Created attachment 902429 [details] etc.clang.tar.xz
Created attachment 902430 [details] etc.portage.tar.xz
Created attachment 902431 [details] logs.tar.xz
Created attachment 902432 [details] qlist-info.txt.xz
Created attachment 902433 [details] sys-apps:fwts-24.03.00:20240908-201752.log.xz
Created attachment 902434 [details] temp.tar.xz
This is a musl issue, has nothing to do with slibtool: https://github.com/fwts/fwts/issues/9 (The summary doesn't mention musl, but emerge-info.txt says this was on a musl system.)