make[2]: *** [Makefile:2105: check-recursive] Error 1 make[2]: Leaving directory '/var/tmp/portage/sys-process/audit-4.0.1-r1/work/audit-4.0.1-abi_x86_64.amd64/auparse' make[1]: *** [Makefile:2256: check] Error 2 make[1]: Leaving directory '/var/tmp/portage/sys-process/audit-4.0.1-r1/work/audit-4.0.1-abi_x86_64.amd64/auparse' make: *** [Makefile:473: check-recursive] Error 1 * ERROR: sys-process/audit-4.0.1-r1::gentoo failed (test phase): * Make check failed. See above for details. * * Call stack: ------------------------------------------------------------------- This is an unstable amd64 chroot image at a tinderbox (==build bot) name: 23.0_test-20240815-161302 The attached etc.portage.tar.xz has all details. ------------------------------------------------------------------- gcc-config -l: [1] x86_64-pc-linux-gnu-14 * clang/llvm (if any): clang version 18.1.8 Target: x86_64-pc-linux-gnu Thread model: posix InstalledDir: /usr/lib/llvm/18/bin Configuration file: /etc/clang/x86_64-pc-linux-gnu-clang.cfg /usr/lib/llvm/18 18.1.8 Python 3.12.5 Available Ruby profiles: [1] ruby31 (with Rubygems) [2] ruby32 (with Rubygems) [3] ruby33 (with Rubygems) * Available Rust versions: [1] rust-bin-1.80.1 * The following VMs are available for generation-2: 1) Eclipse Temurin JDK 17.0.12_p7 [openjdk-bin-17] *) Eclipse Temurin JDK 21.0.4_p7 [openjdk-bin-21] Available Java Virtual Machines: [1] openjdk-bin-17 [2] openjdk-bin-21 system-vm The Glorious Glasgow Haskell Compilation System, version 9.2.8 php cli (if any): [1] php8.3 * go version go1.23.0 linux/amd64 HEAD of ::gentoo commit c0c7979d5e7a5c8ac2b7e7b5fd0a1040f611b255 Author: Repository mirror & CI <repomirrorci@gentoo.org> Date: Sat Aug 17 23:04:05 2024 +0000 2024-08-17 23:04:05 UTC emerge -qpvO =sys-process/audit-4.0.1-r1 [ebuild N ] sys-process/audit-4.0.1-r1 USE="test -gssapi -io-uring -ldap -python (-split-usr) -static-libs" ABI_X86="(64) -32 (-x32)" PYTHON_TARGETS="python3_12 -python3_10 -python3_11 -python3_13"
Created attachment 900510 [details] emerge-info.txt
Created attachment 900511 [details] emerge-history.txt
Created attachment 900512 [details] environment
Created attachment 900513 [details] etc.clang.tar.xz
Created attachment 900514 [details] etc.portage.tar.xz
Created attachment 900515 [details] logs.tar.xz
Created attachment 900516 [details] qlist-info.txt
Created attachment 900517 [details] sys-process:audit-4.0.1-r1:20240817-234602.log
Created attachment 900518 [details] temp.tar.xz