Created attachment 876612 [details] kde-frameworks:kpackage-5.112.0:20231204-060921.log =kde-frameworks/kpackage-5.112.0 fails its test phase for me, specifically the teest plasma-querytest. This is the same test as in bug #630664, but that failuree was fixed in version 5.39.0. The relevant section of the test log is: ********* Start testing of QueryTest ********* Config: Using QtTest library 5.15.11, Qt 5.15.11 (x86_64-little_endian-lp64 shared (dynamic) release build; by GCC 13.2.1 20230826), gentoo 2.14 PASS : QueryTest::initTestCase() find: ‘/Users/alex/.qttest/Library/Application Support’: No such file or directory QWARN : QueryTest::installAndQuery() kf.coreaddons: error parsing "/var/tmp/portage/kde-frameworks/kpackage-5.112.0/work/kpackage-5.112.0/autotests/data/testinvalidmetadata/metadata.json" "unterminated string" QWARN : QueryTest::installAndQuery() kf.coreaddons: error parsing "/var/tmp/portage/kde-frameworks/kpackage-5.112.0/work/kpackage-5.112.0/autotests/data/testinvalidmetadata/metadata.json" "unterminated string" QWARN : QueryTest::installAndQuery() kf.coreaddons: error parsing "/var/tmp/portage/kde-frameworks/kpackage-5.112.0/work/kpackage-5.112.0/autotests/data/testinvalidmetadata/metadata.json" "unterminated string" asked to install valid dep, success! asked to install valid dep, success! package asked to install invalid dep, bailing out QFATAL : QueryTest::installAndQuery() QThread: Destroyed while thread is still running FAIL! : QueryTest::installAndQuery() Received a fatal error. Loc: [Unknown file(0)] Totals: 1 passed, 1 failed, 0 skipped, 0 blacklisted, 600ms ********* Finished testing of QueryTest *********
Created attachment 876613 [details] LastTest.log
Created attachment 876614 [details] emerge-info.txt
Tested fine for me, please re-open when it happens with >=6.3.0.