Gentoo Websites Logo
Go to: Gentoo Home Documentation Forums Lists Bugs Planet Store Wiki Get Gentoo!
Bug 631042 - dev-vcs/git-mantle-0.6 : make: *** [GNUmakefile:45: check] Error 127
Summary: dev-vcs/git-mantle-0.6 : make: *** [GNUmakefile:45: check] Error 127
Status: RESOLVED FIXED
Alias: None
Product: Gentoo Linux
Classification: Unclassified
Component: Current packages (show other bugs)
Hardware: All Linux
: Normal normal
Assignee: No maintainer - Look at https://wiki.gentoo.org/wiki/Project:Proxy_Maintainers if you want to take care of it
URL:
Whiteboard:
Keywords:
Depends on:
Blocks:
 
Reported: 2017-09-15 07:36 UTC by Toralf Förster
Modified: 2018-06-20 17:46 UTC (History)
0 users

See Also:
Package list:
Runtime testing required: ---


Attachments
emerge-info.txt (emerge-info.txt,15.51 KB, text/plain)
2017-09-15 07:36 UTC, Toralf Förster
Details
dev-vcs:git-mantle-0.6:20170914-223717.log (dev-vcs:git-mantle-0.6:20170914-223717.log,2.12 KB, text/plain)
2017-09-15 07:36 UTC, Toralf Förster
Details
emerge-history.txt (emerge-history.txt,142.33 KB, text/plain)
2017-09-15 07:36 UTC, Toralf Förster
Details
environment (environment,75.23 KB, text/plain)
2017-09-15 07:36 UTC, Toralf Förster
Details
etc.portage.tbz2 (etc.portage.tbz2,12.13 KB, application/x-bzip)
2017-09-15 07:36 UTC, Toralf Förster
Details
temp.tbz2 (temp.tbz2,18.87 KB, application/x-bzip)
2017-09-15 07:36 UTC, Toralf Förster
Details
tests.tbz2 (tests.tbz2,3.17 KB, application/x-bzip)
2017-09-15 07:36 UTC, Toralf Förster
Details

Note You need to log in before you can comment on or make changes to this bug.
Description Toralf Förster gentoo-dev 2017-09-15 07:36:29 UTC
cram tests
zsh:1: command not found: cram
make: *** [GNUmakefile:45: check] Error 127
 * ERROR: dev-vcs/git-mantle-0.6::gentoo failed (test phase):
 *   Make check failed. See above for details.
 * 

  -------------------------------------------------------------------

  This is an unstable amd64 chroot image at a tinderbox (==build bot)
  name: 13.0-desktop_20170911-192633

  -------------------------------------------------------------------

gcc-config -l:
 [1] x86_64-pc-linux-gnu-6.4.0 *

Available Python interpreters, in order of preference:
  [1]   python3.4
  [2]   python2.7 (fallback)
  [3]   pypy (fallback)

java-config:
The following VMs are available for generation-2:
*)	IcedTea JDK 3.5.1 [icedtea-bin-8]
Available Java Virtual Machines:
  [1]   icedtea-bin-8  system-vm

emerge -qpv dev-vcs/git-mantle
[ebuild  N    ] dev-vcs/git-mantle-0.6
Comment 1 Toralf Förster gentoo-dev 2017-09-15 07:36:32 UTC
Created attachment 494580 [details]
emerge-info.txt
Comment 2 Toralf Förster gentoo-dev 2017-09-15 07:36:35 UTC
Created attachment 494582 [details]
dev-vcs:git-mantle-0.6:20170914-223717.log
Comment 3 Toralf Förster gentoo-dev 2017-09-15 07:36:39 UTC
Created attachment 494584 [details]
emerge-history.txt
Comment 4 Toralf Förster gentoo-dev 2017-09-15 07:36:42 UTC
Created attachment 494586 [details]
environment
Comment 5 Toralf Förster gentoo-dev 2017-09-15 07:36:45 UTC
Created attachment 494588 [details]
etc.portage.tbz2
Comment 6 Toralf Förster gentoo-dev 2017-09-15 07:36:48 UTC
Created attachment 494590 [details]
temp.tbz2
Comment 7 Toralf Förster gentoo-dev 2017-09-15 07:36:52 UTC
Created attachment 494592 [details]
tests.tbz2
Comment 8 Pacho Ramos gentoo-dev 2018-06-20 15:36:10 UTC
it seems to need dev-util/cram
Comment 9 Pacho Ramos gentoo-dev 2018-06-20 17:46:18 UTC
[master e4af509f6852] dev-vcs/git-mantle: cram needed for tests (#631042 by toralf)
 1 file changed, 8 insertions(+), 7 deletions(-)