***INFO*** There are no declared interface proxies. /bin/sh ../libtool --tag=CC --mode=compile x86_64-pc-linux-gnu-gcc -DHAVE_CONFIG_H -I. -I.. -I/usr/include/python2.5 -I/usr/include/python2.5 -pthread -I/usr/include/pygtk-2.0 -I/usr/include/gtk-2.0 -I/usr/include/glib-2.0 -I/usr/lib64/glib-2.0/include -I/usr/lib64/gtk-2.0/include -I/usr/include/atk-1.0 -I/usr/include/cairo -I/usr/include/gdk-pixbuf-2.0 -I/usr/include/pango-1.0 -I/usr/include/pixman-1 -I/usr/include/freetype2 -I/usr/include/libpng15 -I/usr/include/libdrm -pthread -I/usr/include/metacity-1 -I/usr/include/gtk-2.0 -I/usr/lib64/gtk-2.0/include -I/usr/include/atk-1.0 -I/usr/include/cairo -I/usr/include/gdk-pixbuf-2.0 -I/usr/include/pango-1.0 -I/usr/include/glib-2.0 -I/usr/lib64/glib-2.0/include -I/usr/include/pixman-1 -I/usr/include/freetype2 -I/usr/include/libpng15 -I/usr/include/libdrm -O2 -pipe -Wall -std=c9x -fno-strict-aliasing -MT metacity_la-metacity.lo -MD -MP -MF .deps/metacity_la-metacity.Tpo -c -o metacity_la-metacity.lo `test -f 'metacity.c' || echo './'`metacity.c libtool: compile: x86_64-pc-linux-gnu-gcc -DHAVE_CONFIG_H -I. -I.. -I/usr/include/python2.5 -I/usr/include/python2.5 -pthread -I/usr/include/pygtk-2.0 -I/usr/include/gtk-2.0 -I/usr/include/glib-2.0 -I/usr/lib64/glib-2.0/include -I/usr/lib64/gtk-2.0/include -I/usr/include/atk-1.0 -I/usr/include/cairo -I/usr/include/gdk-pixbuf-2.0 -I/usr/include/pango-1.0 -I/usr/include/pixman-1 -I/usr/include/freetype2 -I/usr/include/libpng15 -I/usr/include/libdrm -pthread -I/usr/include/metacity-1 -I/usr/include/gtk-2.0 -I/usr/lib64/gtk-2.0/include -I/usr/include/atk-1.0 -I/usr/include/cairo -I/usr/include/gdk-pixbuf-2.0 -I/usr/include/pango-1.0 -I/usr/include/glib-2.0 -I/usr/lib64/glib-2.0/include -I/usr/include/pixman-1 -I/usr/include/freetype2 -I/usr/include/libpng15 -I/usr/include/libdrm -O2 -pipe -Wall -std=c9x -fno-strict-aliasing -MT metacity_la-metacity.lo -MD -MP -MF .deps/metacity_la-metacity.Tpo -c metacity.c -fPIC -DPIC -o .libs/metacity_la-metacity.o mv -f .deps/metacity_la-metacitymodule.Tpo .deps/metacity_la-metacitymodule.Plo metacity.c: In function 'pymetacity_add_constants': metacity.c:957:112: error: 'META_FOCUS_MODE_CLICK' undeclared (first use in this function) metacity.c:957:112: note: each undeclared identifier is reported only once for each function it appears in metacity.c:958:113: error: 'META_FOCUS_MODE_SLOPPY' undeclared (first use in this function) metacity.c:959:112: error: 'META_FOCUS_MODE_MOUSE' undeclared (first use in this function) metacity.c:960:124: error: 'META_ACTION_TITLEBAR_TOGGLE_SHADE' undeclared (first use in this function) metacity.c:961:127: error: 'META_ACTION_TITLEBAR_TOGGLE_MAXIMIZE' undeclared (first use in this function) metacity.c:962:120: error: 'META_ACTION_TITLEBAR_MINIMIZE' undeclared (first use in this function) metacity.c:963:116: error: 'META_ACTION_TITLEBAR_NONE' undeclared (first use in this function) metacity.c:964:117: error: 'META_ACTION_TITLEBAR_LOWER' undeclared (first use in this function) metacity.c:965:116: error: 'META_ACTION_TITLEBAR_MENU' undeclared (first use in this function) metacity.c:966:116: error: 'META_ACTION_TITLEBAR_LAST' undeclared (first use in this function) make[2]: *** [metacity_la-metacity.lo] Error 1 make[2]: Leaving directory `/var/tmp/portage/dev-python/metacity-python-2.32.0/work/gnome-python-desktop-2.32.0-2.5/metacity' make[1]: *** [all-recursive] Error 1 make[1]: Leaving directory `/var/tmp/portage/dev-python/metacity-python-2.32.0/work/gnome-python-desktop-2.32.0-2.5' make: *** [all] Error 2 emake failed * ERROR: dev-python/metacity-python-2.32.0 failed (compile phase): * Building failed with CPython 2.5 in python_default_function() function Portage 2.2.0_alpha141 (default/linux/amd64/10.0, gcc-4.6.3, glibc-2.15-r3, 3.5.4-vs2.3.4.3 x86_64) ================================================================= System uname: Linux-3.5.4-vs2.3.4.3-x86_64-AMD_Phenom-tm-_II_X4_965_Processor-with-gentoo-2.2 Timestamp of tree: Unknown app-shells/bash: 4.2_p37 dev-java/java-config: 2.1.12 dev-lang/python: 2.5.4-r4, 2.6.8, 2.7.3-r2, 3.2.3-r1, 3.3.0 dev-util/cmake: 2.8.9-r1 dev-util/pkgconfig: 0.27.1 sys-apps/baselayout: 2.2 sys-apps/openrc: 0.11 sys-apps/sandbox: 2.6 sys-devel/autoconf: 2.13, 2.69 sys-devel/automake: 1.11.6, 1.12.4 sys-devel/binutils: 2.22.90 sys-devel/gcc: 4.6.3 sys-devel/gcc-config: 1.7.3 sys-devel/libtool: 2.4.2 sys-devel/make: 3.82-r4 sys-kernel/linux-headers: 3.6 (virtual/os-headers) sys-libs/glibc: 2.15-r3 Repositories: gentoo ACCEPT_KEYWORDS="amd64 ~amd64" ACCEPT_LICENSE="*" CBUILD="x86_64-pc-linux-gnu" CFLAGS="-O2 -pipe" CHOST="x86_64-pc-linux-gnu" CONFIG_PROTECT="/etc /usr/share/config /usr/share/gnupg/qualified.txt /usr/share/themes/oxygen-gtk/gtk-2.0 /var/lib/hsqldb" CONFIG_PROTECT_MASK="${EPREFIX}/etc/gconf /etc/ca-certificates.conf /etc/dconf /etc/env.d /etc/fonts/fonts.conf /etc/gconf /etc/gentoo-release /etc/revdep-rebuild /etc/sandbox.d /etc/terminfo /etc/texmf/language.dat.d /etc/texmf/language.def.d /etc/texmf/updmap.d /etc/texmf/web2c" CXXFLAGS="-O2 -pipe" DISTDIR="/usr/portage/distfiles" FCFLAGS="-O2 -pipe" FEATURES="assume-digests binpkg-logs config-protect-if-modified distlocks ebuild-locks fixlafiles news parallel-fetch preserve-libs protect-owned sandbox sfperms strict unknown-features-warn unmerge-logs unmerge-orphans userfetch" FFLAGS="-O2 -pipe" GENTOO_MIRRORS="http://distfiles.gentoo.org" LANG="en_US" LDFLAGS="-Wl,-O1 -Wl,--as-needed" MAKEOPTS="-j4" PKGDIR="/usr/portage/packages" PORTAGE_CONFIGROOT="/" PORTAGE_RSYNC_OPTS="--recursive --links --safe-links --perms --times --compress --force --whole-file --delete --stats --human-readable --timeout=180 --exclude=/distfiles --exclude=/local --exclude=/packages" PORTAGE_TMPDIR="/var/tmp" PORTDIR="/usr/portage" PORTDIR_OVERLAY="" SYNC="rsync://rsync.gentoo.org/gentoo-portage" USE="X acl amd64 berkdb bzip2 cairo cli compat cracklib crypt cups cxx dbus dri fontconfig fortran gdbm gpm gudev iconv ipv6 jpeg minizip mmx modules mssql mudflap multilib ncurses nls nptl odbc opengl openmp pam pcre png pppd python qt3support readline script session sqlite sse sse2 ssl tcpd threads tiff tk truetype unicode webkit xml zlib" ALSA_CARDS="ali5451 als4000 atiixp atiixp-modem bt87x ca0106 cmipci emu10k1x ens1370 ens1371 es1938 es1968 fm801 hda-intel intel8x0 intel8x0m maestro3 trident usb-audio via82xx via82xx-modem ymfpci" ALSA_PCM_PLUGINS="adpcm alaw asym copy dmix dshare dsnoop empty extplug file hooks iec958 ioplug ladspa lfloat linear meter mmap_emul mulaw multi null plug rate route share shm softvol" APACHE2_MODULES="authn_core authz_core socache_shmcb unixd actions alias auth_basic authn_alias authn_anon authn_dbm authn_default authn_file authz_dbm authz_default authz_groupfile authz_host authz_owner authz_user autoindex cache cgi cgid dav dav_fs dav_lock deflate dir disk_cache env expires ext_filter file_cache filter headers include info log_config logio mem_cache mime mime_magic negotiation rewrite setenvif speling status unique_id userdir usertrack vhost_alias" CALLIGRA_FEATURES="kexi words flow plan sheets stage tables krita karbon braindump" CAMERAS="ptp2" COLLECTD_PLUGINS="df interface irq load memory rrdtool swap syslog" ELIBC="glibc" GPSD_PROTOCOLS="ashtech aivdm earthmate evermore fv18 garmin garmintxt gpsclock itrax mtk3301 nmea ntrip navcom oceanserver oldstyle oncore rtcm104v2 rtcm104v3 sirf superstar2 timing tsip tripmate tnt ubx" INPUT_DEVICES="keyboard mouse evdev" KERNEL="linux" LCD_DEVICES="bayrad cfontz cfontz633 glk hd44780 lb216 lcdm001 mtxorb ncurses text" LIBREOFFICE_EXTENSIONS="presenter-console presenter-minimizer" PHP_TARGETS="php5-3" PYTHON_TARGETS="python3_2 python2_7" RUBY_TARGETS="ruby18" USERLAND="GNU" VIDEO_CARDS="vesa radeon" XTABLES_ADDONS="quota2 psd pknock lscan length2 ipv4options ipset ipp2p iface geoip fuzzy condition tee tarpit sysrq steal rawnat logmark ipmark dhcpmac delude chaos account" USE_PYTHON="2.5 2.6 2.7 3.2 3.3 2.7-pypy-1.8 2.7-pypy-1.9 2.5-jython" Unset: CPPFLAGS, CTARGET, EMERGE_DEFAULT_OPTS, INSTALL_MASK, LC_ALL, LINGUAS, PORTAGE_BUNZIP2_COMMAND, PORTAGE_COMPRESS, PORTAGE_COMPRESS_FLAGS, PORTAGE_RSYNC_EXTRA_OPTS
It still builds for me, what metacity version do you have installed? Maybe we could remove this as nothing requires it and looks like won't be updated ever
I also get the failed build; 2 versions of metacity. # emerge =dev-python/metacity-python-2.32.0 (pulls in metacity 2.34.13) # emerge =x11-wm/metacity-2.34.8 =dev-python/metacity-python-2.32.0 both yield same as Patrick. Now to find the diff between the systems
I think we should remove this as metacity is deprecated and I don't think anything will ever use metacity-python
you mean lastrite it?
(In reply to comment #4) > you mean lastrite it? yes
lastrited (masked) now.
dropped