With the following error: * Context: * Source: Yes make[2]: *** [po/avidemux_pt_BR.qm] Error 1 make[1]: *** [po/CMakeFiles/qmfiles.dir/all] Error 2 make[1]: *** Waiting for unfinished jobs.... In file included from /var/tmp/portage/media-video/avidemux-2.4.3/work/avidemux_2.4.3/avidemux/ADM_userInterfaces/ADM_QT4/ADM_gui/Q_gui2.cpp:87, from /var/tmp/portage/media-video/avidemux-2.4.3/work/avidemux_build/avidemux/ADM_userInterfaces/ADM_QT4/ADM_gui/AQ_gui2.cpp:1: /var/tmp/portage/media-video/avidemux-2.4.3/work/avidemux_2.4.3/avidemux/ADM_userInterfaces/ADM_QT4/ADM_gui/translation_table.h:80:29: warning: backslash-newline at end of file In file included from /var/tmp/portage/media-video/avidemux-2.4.3/work/avidemux_build/avidemux/ADM_userInterfaces/ADM_QT4/ADM_gui/AQ_gui2.cpp:2: /var/tmp/portage/media-video/avidemux-2.4.3/work/avidemux_2.4.3/avidemux/ADM_userInterfaces/ADM_QT4/ADM_gui/Q_gui2.cpp:95: warning: 'typedef' was ignored in this declaration Linking CXX static library libADM_guiQt4.a [ 94%] Built target ADM_guiQt4 make: *** [all] Error 2 * * ERROR: media-video/avidemux-2.4.3 failed. * Call stack: * ebuild.sh, line 48: Called src_compile * environment, line 2854: Called cmake-utils_src_compile * environment, line 753: Called cmake-utils_src_make * environment, line 825: Called die * The specific snippet of code: * emake "$@" || die "Make failed!"; * The die message: * Make failed! * * If you need support, post the topmost build error, and the call stack if relevant. * A complete build log is located at '/var/tmp/portage/media-video/avidemux-2.4.3/temp/build.log'. * The ebuild environment file is located at '/var/tmp/portage/media-video/avidemux-2.4.3/temp/environment'. Portage 2.1.6.11 (default/linux/amd64/2008.0/desktop, gcc-4.3.2, glibc-2.8_p20080602-r1, 2.6.28-gentoo-r4 x86_64) ================================================================= System uname: Linux-2.6.28-gentoo-r4-x86_64-AMD_Athlon-tm-_64_Processor_3200+-with-glibc2.2.5 Timestamp of tree: Tue, 07 Apr 2009 09:30:01 +0000 ccache version 2.4 [enabled] app-shells/bash: 3.2_p39 dev-java/java-config: 2.1.7 dev-lang/python: 2.5.2-r7 dev-python/pycrypto: 2.0.1-r8 dev-util/ccache: 2.4-r7 dev-util/cmake: 2.6.2-r1 sys-apps/baselayout: 1.12.11.1 sys-apps/sandbox: 1.2.18.1-r2 sys-devel/autoconf: 2.13, 2.63 sys-devel/automake: 1.5, 1.7.9-r1, 1.8.5-r3, 1.9.6-r2, 1.10.2 sys-devel/binutils: 2.18-r3 sys-devel/gcc-config: 1.4.0-r4 sys-devel/libtool: 1.5.26 virtual/os-headers: 2.6.27-r2 ACCEPT_KEYWORDS="amd64" CBUILD="x86_64-pc-linux-gnu" CFLAGS="-march=native -O2 -pipe" CHOST="x86_64-pc-linux-gnu" CONFIG_PROTECT="/etc /usr/kde/3.5/env /usr/kde/3.5/share/config /usr/kde/3.5/shutdown /usr/share/config /var/lib/hsqldb" CONFIG_PROTECT_MASK="/etc/ca-certificates.conf /etc/env.d /etc/env.d/java/ /etc/fonts/fonts.conf /etc/gconf /etc/revdep-rebuild /etc/terminfo /etc/texmf/language.dat.d /etc/texmf/language.def.d /etc/texmf/updmap.d /etc/texmf/web2c /etc/udev/rules.d" CXXFLAGS="-march=native -O2 -pipe" DISTDIR="/usr/distfiles" FEATURES="autoaddcvs ccache collision-protect cvs distlocks fixpackages multilib-strict parallel-fetch protect-owned sandbox sfperms strict unmerge-orphans userfetch" GENTOO_MIRRORS="ftp://ftp.free.fr/mirrors/ftp.gentoo.org" LANG="es_ES.UTF-8" LC_ALL="es_ES.UTF-8" LDFLAGS="-Wl,-O1" LINGUAS="es es_ES en_US" MAKEOPTS="-j2" PKGDIR="/usr/portage/packages" PORTAGE_CONFIGROOT="/" PORTAGE_RSYNC_OPTS="--recursive --links --safe-links --perms --times --compress --force --whole-file --delete --stats --timeout=180 --exclude=/distfiles --exclude=/local --exclude=/packages" PORTAGE_TMPDIR="/var/tmp" PORTDIR="/usr/portage" PORTDIR_OVERLAY="/usr/portage/local/layman/sunrise /usr/portage/local/layman/sunrise /usr/local/portage" SYNC="rsync://rsync.gentoo.org/gentoo-portage" USE="3dnow 3dnowext X a52 aac acl acpi alsa amd64 applet avahi bash-completion beagle berkdb branding bzip2 cairo cddb cdinstall cdr cleartype cli consolekit cracklib crypt css cups daap dbus djvu dri dts dvd dvdr dvdread dvi eds emboss encode esd evo exif fam fat ffmpeg firefox flac fortran fuse gdbm gif git glitz gnome gnome-keyring gpm gstreamer gtk hal iconv imagemagick isdnlog java jpeg jpeg2k kdeenablefinal kdehiddenvisibility kpathsea latex libnotify lyx lzma mad midi mikmod mmx mmxext mono mp3 mpeg mudflap multilib musicbrainz nautilus ncurses network network-cron nls nptl nptlonly ntfs nvidia ogg opengl openmp pam pango pch pcre pdf perl png ppds pppd python qt3support qt4 quicktime readline reflection reiserfs scanner sdl session spell spl sse sse2 ssl ssse3 startup-notification subversion svg sysfs t1lib tcpd threads tiff truetype unicode usb v4l2 vcd vorbis webkit xattr xcb xinetd xml xmp xorg xpm xulrunner xv xvid zeroconf zlib" ALSA_CARDS="via82xx" ALSA_PCM_PLUGINS="adpcm alaw asym copy dmix dshare dsnoop empty extplug file hooks iec958 ioplug ladspa lfloat linear meter mmap_emul mulaw multi null plug rate route share shm softvol" APACHE2_MODULES="actions alias auth_basic authn_alias authn_anon authn_dbm authn_default authn_file authz_dbm authz_default authz_groupfile authz_host authz_owner authz_user autoindex cache dav dav_fs dav_lock deflate dir disk_cache env expires ext_filter file_cache filter headers include info log_config logio mem_cache mime mime_magic negotiation rewrite setenvif speling status unique_id userdir usertrack vhost_alias" ELIBC="glibc" INPUT_DEVICES="evdev" KERNEL="linux" LCD_DEVICES="bayrad cfontz cfontz633 glk hd44780 lb216 lcdm001 mtxorb ncurses text" LINGUAS="es es_ES en_US" USERLAND="GNU" VIDEO_CARDS="nvidia nv vesa" Unset: CPPFLAGS, CTARGET, EMERGE_DEFAULT_OPTS, FFLAGS, INSTALL_MASK, PORTAGE_COMPRESS, PORTAGE_COMPRESS_FLAGS, PORTAGE_RSYNC_EXTRA_OPTS Reproducible: Always
Created attachment 187548 [details] build.log
2.4.4 merged ok
Real error is few lines back: lrelease error: duplicate messages found in '/var/tmp/portage/media-video/avidemux-2.4.3/work/avidemux_build/po/avidemux_pt_BR.xml'
This is one of those cases that shows that mixing stable and testing is not always a good idea. Stable avidemux works with stable qt. The avidemux version in testing branch has the qt4 useflag disabled, because it breaks with the qt version in testing branch. I don't have the time to hunt for a proper fix, so I'm closing this as "wontfix". But I would accept a patch...
I think that would be better wait for getting 2.4.4 stabilized in a near future then :-)