Gentoo Websites Logo
Go to: Gentoo Home Documentation Forums Lists Bugs Planet Store Wiki Get Gentoo!
Bug 169993 - media-gfx/graphviz-2.8-r2 fails compilation
Summary: media-gfx/graphviz-2.8-r2 fails compilation
Status: RESOLVED WONTFIX
Alias: None
Product: Gentoo Linux
Classification: Unclassified
Component: New packages (show other bugs)
Hardware: All Linux
: High normal (vote)
Assignee: Gentoo Linux bug wranglers
URL:
Whiteboard:
Keywords:
Depends on:
Blocks:
 
Reported: 2007-03-08 18:58 UTC by John J. Aylward
Modified: 2007-03-08 20:27 UTC (History)
0 users

See Also:
Package list:
Runtime testing required: ---


Attachments
build.log (build.log,190.27 KB, text/plain)
2007-03-08 18:59 UTC, John J. Aylward
Details

Note You need to log in before you can comment on or make changes to this bug.
Description John J. Aylward 2007-03-08 18:58:25 UTC
use flags enabled: X cairo java perl php python tcl tk


htmllex.c: In function 'characterData':
htmllex.c:550: warning: value computed is not used
htmllex.c: In function 'comp_entities':
htmllex.c:635: error: dereferencing pointer to incomplete type
htmllex.c:635: error: dereferencing pointer to incomplete type
htmllex.c:635: error: dereferencing pointer to incomplete type
htmllex.c:635: error: dereferencing pointer to incomplete type
htmllex.c:635: error: dereferencing pointer to incomplete type
htmllex.c:635: error: dereferencing pointer to incomplete type
htmllex.c:635: error: dereferencing pointer to incomplete type
htmllex.c:635: error: dereferencing pointer to incomplete type
htmllex.c:635: error: dereferencing pointer to incomplete type
htmllex.c:635: error: dereferencing pointer to incomplete type
htmllex.c:635: error: dereferencing pointer to incomplete type
htmllex.c:635: error: dereferencing pointer to incomplete type
htmllex.c:635: error: dereferencing pointer to incomplete type
htmllex.c:635: error: dereferencing pointer to incomplete type
htmllex.c:635: error: dereferencing pointer to incomplete type
htmllex.c:635: error: dereferencing pointer to incomplete type
htmllex.c:635: error: dereferencing pointer to incomplete type
htmllex.c:635: error: dereferencing pointer to incomplete type
htmllex.c:635: error: dereferencing pointer to incomplete type
htmllex.c:635: error: dereferencing pointer to incomplete type
htmllex.c:635: error: dereferencing pointer to incomplete type
htmllex.c:635: error: dereferencing pointer to incomplete type
htmllex.c:635: error: dereferencing pointer to incomplete type
htmllex.c:635: error: dereferencing pointer to incomplete type
htmllex.c:635: error: dereferencing pointer to incomplete type
htmllex.c:635: error: dereferencing pointer to incomplete type
htmllex.c:635: error: dereferencing pointer to incomplete type
htmllex.c:635: error: dereferencing pointer to incomplete type
htmllex.c:635: error: dereferencing pointer to incomplete type
htmllex.c:635: error: dereferencing pointer to incomplete type
htmllex.c:635: error: dereferencing pointer to incomplete type
htmllex.c:635: error: dereferencing pointer to incomplete type
htmllex.c:635: error: dereferencing pointer to incomplete type
htmllex.c:635: error: dereferencing pointer to incomplete type
htmllex.c:635: error: dereferencing pointer to incomplete type
htmllex.c:635: error: dereferencing pointer to incomplete type
htmllex.c:635: error: dereferencing pointer to incomplete type
htmllex.c:635: error: dereferencing pointer to incomplete type
htmllex.c:635: error: dereferencing pointer to incomplete type
htmllex.c:635: error: dereferencing pointer to incomplete type
htmllex.c: In function 'scanEntity':
htmllex.c:647: error: storage size of 'key' isn't known
htmllex.c:657: error: 'entities' undeclared (first use in this function)
htmllex.c:657: error: (Each undeclared identifier is reported only once
htmllex.c:657: error: for each function it appears in.)
htmllex.c:657: error: 'NR_OF_ENTITIES' undeclared (first use in this function)
htmllex.c:660: error: dereferencing pointer to incomplete type
htmllex.c:647: warning: unused variable 'key'
htmllex.c: In function 'findNext':
htmllex.c:688: warning: value computed is not used
htmllex.c:694: warning: value computed is not used
make[3]: *** [htmllex.lo] Error 1
make[3]: *** Waiting for unfinished jobs....
 x86_64-pc-linux-gnu-gcc -DHAVE_CONFIG_H -I. -I../.. -I../.. -I../../lib/gvc -I../../lib/pack -I../../lib/fdpgen -I../../lib/pathplan -I../../lib/graph -I../../lib/cdt -I/usr/include -march=athlon64 -O2 -pipe -Wno-unknown-pragmas -Wstrict-prototypes -Wpointer-arith -Wall -ffast-math -c htmltable.c  -fPIC -DPIC -o .libs/htmltable.o
make[3]: Leaving directory `/var/tmp/portage/media-gfx/graphviz-2.8-r2/work/graphviz-2.8/lib/common'
make[2]: *** [all-recursive] Error 1
make[2]: Leaving directory `/var/tmp/portage/media-gfx/graphviz-2.8-r2/work/graphviz-2.8/lib'
make[1]: *** [all-recursive] Error 1
make[1]: Leaving directory `/var/tmp/portage/media-gfx/graphviz-2.8-r2/work/graphviz-2.8'
make: *** [all] Error 2

!!! ERROR: media-gfx/graphviz-2.8-r2 failed.
Call stack:
  ebuild.sh, line 1614:   Called dyn_compile
  ebuild.sh, line 971:   Called qa_call 'src_compile'
  environment, line 3476:   Called src_compile
  graphviz-2.8-r2.ebuild, line 84:   Called die
Comment 1 John J. Aylward 2007-03-08 18:59:09 UTC
Created attachment 112607 [details]
build.log
Comment 2 Jakub Moc (RETIRED) gentoo-dev 2007-03-08 20:27:50 UTC
Reopen if 2.12 doesn't work for you.