Gentoo Websites Logo
Go to: Gentoo Home Documentation Forums Lists Bugs Planet Store Wiki Get Gentoo!
Bug 857909 - dev-python/argparse-manpage-3 fails tests
Summary: dev-python/argparse-manpage-3 fails tests
Status: UNCONFIRMED
Alias: None
Product: Gentoo Linux
Classification: Unclassified
Component: Current packages (show other bugs)
Hardware: All Linux
: Normal normal (vote)
Assignee: Patrick McLean
URL:
Whiteboard:
Keywords:
Depends on:
Blocks: 811936
  Show dependency tree
 
Reported: 2022-07-13 23:08 UTC by Jonathan Lovelace
Modified: 2022-09-22 19:29 UTC (History)
1 user (show)

See Also:
Package list:
Runtime testing required: ---


Attachments
dev-python:argparse-manpage-3:20220713-213642.log (dev-python:argparse-manpage-3:20220713-213642.log,25.72 KB, text/x-log)
2022-07-13 23:08 UTC, Jonathan Lovelace
Details
emerge-info.txt (emerge-info.txt,8.42 KB, text/plain)
2022-07-13 23:08 UTC, Jonathan Lovelace
Details

Note You need to log in before you can comment on or make changes to this bug.
Description Jonathan Lovelace 2022-07-13 23:08:07 UTC
Created attachment 791345 [details]
dev-python:argparse-manpage-3:20220713-213642.log

=dev-python/argparse-manpage-3 fails its test phase while rebuilding against Python 3.10. It looks to me like all of the "examples" in tests/test_examples.py::TestAllExapmles failed when run against pip but passed when run against setuppy.

=========================== short test summary info ============================                              
FAILED tests/test_examples.py::TestAllExapmles::test_copr[pip] - FileNotFound...                              
FAILED tests/test_examples.py::TestAllExapmles::test_distgen[pip] - FileNotFo...                              
FAILED tests/test_examples.py::TestAllExapmles::test_resalloc[pip] - FileNotF...                              
FAILED tests/test_examples.py::TestAllExapmles::test_argument_groups_example[pip]                             
FAILED tests/test_examples.py::TestAllExapmles::test_osc[pip] - FileNotFoundE...                              
=================== 5 failed, 12 passed, 1 warning in 20.88s ===================
Comment 1 Jonathan Lovelace 2022-07-13 23:08:46 UTC
Created attachment 791348 [details]
emerge-info.txt