Gentoo Websites Logo
Go to: Gentoo Home Documentation Forums Lists Bugs Planet Store Wiki Get Gentoo!
Bug 855257 - can't emerge firefox-91.11.1
Summary: can't emerge firefox-91.11.1
Status: RESOLVED DUPLICATE of bug 838373
Alias: None
Product: Gentoo Linux
Classification: Unclassified
Component: Current packages (show other bugs)
Hardware: All Linux
: Normal normal (vote)
Assignee: Gentoo Linux bug wranglers
Depends on:
Reported: 2022-06-30 06:44 UTC by John Blbec
Modified: 2022-06-30 08:13 UTC (History)
0 users

See Also:
Package list:
Runtime testing required: ---

firefox build log (firefox_build.log.tar.bz2,313.35 KB, application/x-bzip)
2022-06-30 06:46 UTC, John Blbec
emerge --info (emerge_info.txt,6.08 KB, text/plain)
2022-06-30 06:46 UTC, John Blbec

Note You need to log in before you can comment on or make changes to this bug.
Description John Blbec 2022-06-30 06:44:22 UTC
85:38.93 warning: the following packages contain code that will be rejected by a future version of Rust: cascade_bloom_filter v0.1.0 (/var/tmp/portage/www-client/firefox-91.11.0/work/firefox-91.11.0/toolkit/components/cascade_bloom_filter), cert_storage v0.0.1 (/var/tmp/portage/www-client/firefox-91.11.0/work/firefox-91.11.0/security/manager/ssl/cert_storage), rental v0.5.6
85:38.93 note: to see what the problems were, use the option `--future-incompat-report`, or run `cargo report future-incompatibilities --id 1`
85:39.22 gmake[4]: Leaving directory '/var/tmp/portage/www-client/firefox-91.11.0/work/firefox_build/toolkit/library/rust'
85:39.22 gmake[3]: Leaving directory '/var/tmp/portage/www-client/firefox-91.11.0/work/firefox_build'
85:39.22 gmake[2]: *** [/var/tmp/portage/www-client/firefox-91.11.0/work/firefox-91.11.0/config/ compile] Error 2
85:39.22 gmake[2]: Leaving directory '/var/tmp/portage/www-client/firefox-91.11.0/work/firefox_build'
85:39.22 gmake[1]: *** [/var/tmp/portage/www-client/firefox-91.11.0/work/firefox-91.11.0/config/ default] Error 2
85:39.22 gmake[1]: Leaving directory '/var/tmp/portage/www-client/firefox-91.11.0/work/firefox_build'
85:39.22 gmake: *** [ build] Error 2
85:39.22 31 compiler warnings present.
 * ERROR: www-client/firefox-91.11.0::gentoo failed (compile phase):
 *   (no error message)
 * Call stack:
 *, line 127:  Called src_compile
 *   environment, line 5193:  Called die
 * The specific snippet of code:
 *       ${virtx_cmd} ./mach build --verbose || die
Comment 1 John Blbec 2022-06-30 06:46:14 UTC
Created attachment 788864 [details]
firefox build log
Comment 2 John Blbec 2022-06-30 06:46:50 UTC
Created attachment 788867 [details]
emerge --info
Comment 3 Joonas Niilola gentoo-dev 2022-06-30 08:13:19 UTC

*** This bug has been marked as a duplicate of bug 838373 ***