Gentoo Websites Logo
Go to: Gentoo Home Documentation Forums Lists Bugs Planet Store Wiki Get Gentoo!
Bug 845159 - media-gfx/inkscape-1.1.2-r1 fails tests on stable x86/amd64
Summary: media-gfx/inkscape-1.1.2-r1 fails tests on stable x86/amd64
Status: CONFIRMED
Alias: None
Product: Gentoo Linux
Classification: Unclassified
Component: Current packages (show other bugs)
Hardware: All Linux
: Normal normal (vote)
Assignee: Mikle Kolyada
URL:
Whiteboard:
Keywords:
Depends on:
Blocks:
 
Reported: 2022-05-17 09:29 UTC by Agostino Sarubbo
Modified: 2022-09-19 05:46 UTC (History)
2 users (show)

See Also:
Package list:
Runtime testing required: ---


Attachments
build.log.xz (build.log.xz,59.11 KB, application/x-xz)
2022-05-17 09:29 UTC, Agostino Sarubbo
Details

Note You need to log in before you can comment on or make changes to this bug.
Description Agostino Sarubbo gentoo-dev 2022-05-17 09:29:08 UTC
https://blogs.gentoo.org/ago/2020/07/04/gentoo-tinderbox/

Issue: media-gfx/inkscape-1.1.2-r1 fails tests on stable x86.
Discovered on: x86 (internal ref: x86_at)
Comment 1 Agostino Sarubbo gentoo-dev 2022-05-17 09:29:10 UTC
Created attachment 779330 [details]
build.log.xz

build log and emerge --info (compressed because it exceeds attachment limit, use 'xzless' to read it)
Comment 2 Agostino Sarubbo gentoo-dev 2022-05-17 09:41:31 UTC
the same happens on stable amd64
Comment 3 Sam James archtester Gentoo Infrastructure gentoo-dev Security 2022-05-17 22:04:38 UTC
294/298 Test #294: render_test-glyph-y-pos .............................................***Failed    2.51 sec
Background RRGGBBAA: ffffff00
Area 0:0:600:600 exported to 600 x 600 pixels (96 dpi)
9281
test-glyph-y-pos FAILED
Background RRGGBBAA: ffffff00
Area 0:0:600:600 exported to 2400 x 2400 pixels (384 dpi)
test-glyph-y-pos-large FAILED

        Start 295: render_test-rtl-vertical
295/298 Test #295: render_test-rtl-vertical ............................................***Failed    3.02 sec
Background RRGGBBAA: ffffff00
Area 0:0:600:600 exported to 600 x 600 pixels (96 dpi)
7369
test-rtl-vertical FAILED
Background RRGGBBAA: ffffff00
Area 0:0:600:600 exported to 2400 x 2400 pixels (384 dpi)
test-rtl-vertical-large FAILED

        Start 296: render_text-glyphs-combining
296/298 Test #296: render_text-glyphs-combining ........................................***Failed    2.66 sec
end_font_face_cb: font face rule limited support.
  font-family : 'Noto Sans';
  src : url(fonts/NotoSans-Regular.ttf)
end_font_face_cb: Added font: /var/tmp/portage/media-gfx/inkscape-1.1.2-r1/work/inkscape-1.1.2/testfiles/rendering_tests/fonts/NotoSans-Regular.ttf
Background RRGGBBAA: ffffff00
Area 0:0:600:600 exported to 600 x 600 pixels (96 dpi)
0
text-glyphs-combining PASSED
end_font_face_cb: font face rule limited support.
  font-family : 'Noto Sans';
  src : url(fonts/NotoSans-Regular.ttf)
end_font_face_cb: Added font: /var/tmp/portage/media-gfx/inkscape-1.1.2-r1/work/inkscape-1.1.2/testfiles/rendering_tests/fonts/NotoSans-Regular.ttf
Background RRGGBBAA: ffffff00
Area 0:0:600:600 exported to 2400 x 2400 pixels (384 dpi)
text-glyphs-combining-large FAILED

        Start 297: render_text-glyphs-vertical
297/298 Test #297: render_text-glyphs-vertical .........................................***Failed    2.71 sec
end_font_face_cb: font face rule limited support.
  font-family : 'Noto Sans';
  src : url(fonts/NotoSans-Regular.ttf)
end_font_face_cb: Added font: /var/tmp/portage/media-gfx/inkscape-1.1.2-r1/work/inkscape-1.1.2/testfiles/rendering_tests/fonts/NotoSans-Regular.ttf
end_font_face_cb: font face rule limited support.
  font-family : 'Noto Sans CJK JP';
  src : url(fonts/NotoSansCJKjp-Regular.otf)
end_font_face_cb: Added font: /var/tmp/portage/media-gfx/inkscape-1.1.2-r1/work/inkscape-1.1.2/testfiles/rendering_tests/fonts/NotoSansCJKjp-Regular.otf
end_font_face_cb: font face rule limited support.
  font-family : 'GeomTest';
  src : url(fonts/GeomTest-Regular.otf)
end_font_face_cb: Added font: /var/tmp/portage/media-gfx/inkscape-1.1.2-r1/work/inkscape-1.1.2/testfiles/rendering_tests/fonts/GeomTest-Regular.otf
Background RRGGBBAA: ffffff00
Area 0:0:600:600 exported to 600 x 600 pixels (96 dpi)
1357
text-glyphs-vertical FAILED
end_font_face_cb: font face rule limited support.
  font-family : 'Noto Sans';
  src : url(fonts/NotoSans-Regular.ttf)
end_font_face_cb: Added font: /var/tmp/portage/media-gfx/inkscape-1.1.2-r1/work/inkscape-1.1.2/testfiles/rendering_tests/fonts/NotoSans-Regular.ttf
end_font_face_cb: font face rule limited support.
  font-family : 'Noto Sans CJK JP';
  src : url(fonts/NotoSansCJKjp-Regular.otf)
end_font_face_cb: Added font: /var/tmp/portage/media-gfx/inkscape-1.1.2-r1/work/inkscape-1.1.2/testfiles/rendering_tests/fonts/NotoSansCJKjp-Regular.otf
end_font_face_cb: font face rule limited support.
  font-family : 'GeomTest';
  src : url(fonts/GeomTest-Regular.otf)
end_font_face_cb: Added font: /var/tmp/portage/media-gfx/inkscape-1.1.2-r1/work/inkscape-1.1.2/testfiles/rendering_tests/fonts/GeomTest-Regular.otf
Background RRGGBBAA: ffffff00
Area 0:0:600:600 exported to 2400 x 2400 pixels (384 dpi)
text-glyphs-vertical-large FAILED

        Start 298: render_test-powerstroke-join
298/298 Test #298: render_test-powerstroke-join ........................................   Passed    0.91 sec

99% tests passed, 4 tests failed out of 298
Comment 4 Sam James archtester Gentoo Infrastructure gentoo-dev Security 2022-05-17 22:04:44 UTC
The following tests FAILED:
	294 - render_test-glyph-y-pos (Failed)
	295 - render_test-rtl-vertical (Failed)
	296 - render_text-glyphs-combining (Failed)
	297 - render_text-glyphs-vertical (Failed)
Errors while running CTest
ninja: build stopped: subcommand failed.
 * ERROR: media-gfx/inkscape-1.1.2-r1::gentoo failed (test phase):
 *   ninja -v -j8 -l0 -j1 check failed