Gentoo Websites Logo
Go to: Gentoo Home Documentation Forums Lists Bugs Planet Store Wiki Get Gentoo!
Bug 827959 - dev-lang/spidermonkey-78.15.0[lto] - ld.gold: error: /opt/rust-bin-1.56.1/lib/rustlib/powerpc-unknown-linux-gnu/lib/libcore-c6b8dc14a5b4fbee.rlib(core-c6b8dc14a5b4fbee.core.e506d314-cgu.0.rcgu.o): unsupported -mbss-plt code
Summary: dev-lang/spidermonkey-78.15.0[lto] - ld.gold: error: /opt/rust-bin-1.56.1/lib...
Status: UNCONFIRMED
Alias: None
Product: Gentoo Linux
Classification: Unclassified
Component: Current packages (show other bugs)
Hardware: PPC Linux
: Normal normal (vote)
Assignee: Mozilla Gentoo Team
URL:
Whiteboard:
Keywords:
Depends on:
Blocks:
 
Reported: 2021-12-02 00:12 UTC by ernsteiswuerfel
Modified: 2021-12-02 00:17 UTC (History)
0 users

See Also:
Package list:
Runtime testing required: ---


Attachments
build.log (spidermonkey-78.15.0:20211201-234525.log,615.39 KB, text/plain)
2021-12-02 00:12 UTC, ernsteiswuerfel
Details
emerge --info (file_827959.txt,5.69 KB, text/plain)
2021-12-02 00:17 UTC, ernsteiswuerfel
Details

Note You need to log in before you can comment on or make changes to this bug.
Description ernsteiswuerfel archtester 2021-12-02 00:12:21 UTC
Created attachment 757156 [details]
build.log

[...]
          /usr/lib/gcc/powerpc-unknown-linux-gnu/11.2.0/../../../../powerpc-unknown-linux-gnu/bin/ld.gold: error: /opt/rust-bin-1.56.1/lib/rustlib/powerpc-unknown-linux-gnu/lib/libcore-c6b8dc14a5b4fbee.rlib(core-c6b8dc14a5b4fbee.core.e506d314-cgu.0.rcgu.o): unsupported -mbss-plt code
          /usr/lib/gcc/powerpc-unknown-linux-gnu/11.2.0/../../../../powerpc-unknown-linux-gnu/bin/ld.gold: error: /opt/rust-bin-1.56.1/lib/rustlib/powerpc-unknown-linux-gnu/lib/libcore-c6b8dc14a5b4fbee.rlib(core-c6b8dc14a5b4fbee.core.e506d314-cgu.0.rcgu.o): unsupported -mbss-plt code
          /usr/lib/gcc/powerpc-unknown-linux-gnu/11.2.0/../../../../powerpc-unknown-linux-gnu/bin/ld.gold: error: /opt/rust-bin-1.56.1/lib/rustlib/powerpc-unknown-linux-gnu/lib/libcore-c6b8dc14a5b4fbee.rlib(core-c6b8dc14a5b4fbee.core.e506d314-cgu.0.rcgu.o): unsupported -mbss-plt code
          /usr/lib/gcc/powerpc-unknown-linux-gnu/11.2.0/../../../../powerpc-unknown-linux-gnu/bin/ld.gold: error: /opt/rust-bin-1.56.1/lib/rustlib/powerpc-unknown-linux-gnu/lib/libcore-c6b8dc14a5b4fbee.rlib(core-c6b8dc14a5b4fbee.core.e506d314-cgu.0.rcgu.o): unsupported -mbss-plt code
          /usr/lib/gcc/powerpc-unknown-linux-gnu/11.2.0/../../../../powerpc-unknown-linux-gnu/bin/ld.gold: error: /opt/rust-bin-1.56.1/lib/rustlib/powerpc-unknown-linux-gnu/lib/libcore-c6b8dc14a5b4fbee.rlib(core-c6b8dc14a5b4fbee.core.e506d314-cgu.0.rcgu.o): unsupported -mbss-plt code
          /usr/lib/gcc/powerpc-unknown-linux-gnu/11.2.0/../../../../powerpc-unknown-linux-gnu/bin/ld.gold: error: /opt/rust-bin-1.56.1/lib/rustlib/powerpc-unknown-linux-gnu/lib/libcompiler_builtins-b21d3f172280168c.rlib(compiler_builtins-b21d3f172280168c.compiler_builtins.ecc5fa08-cgu.69.rcgu.o): unsupported -mbss-plt code
          /usr/lib/gcc/powerpc-unknown-linux-gnu/11.2.0/../../../../powerpc-unknown-linux-gnu/bin/ld.gold: error: /opt/rust-bin-1.56.1/lib/rustlib/powerpc-unknown-linux-gnu/lib/libcompiler_builtins-b21d3f172280168c.rlib(compiler_builtins-b21d3f172280168c.compiler_builtins.ecc5fa08-cgu.94.rcgu.o): unsupported -mbss-plt code
          collect2: error: ld returned 1 exit status
          

warning: `wast` (lib) generated 1 warning
error: build failed
make[3]: *** [/var/tmp/portage/dev-lang/spidermonkey-78.15.0/work/firefox-78.15.0/config/makefiles/rust.mk:312: force-cargo-library-build] Error 101
make[3]: Leaving directory '/var/tmp/portage/dev-lang/spidermonkey-78.15.0/work/build/js/src/rust'
make[2]: *** [/var/tmp/portage/dev-lang/spidermonkey-78.15.0/work/firefox-78.15.0/config/recurse.mk:74: js/src/rust/target] Error 2
make[2]: Leaving directory '/var/tmp/portage/dev-lang/spidermonkey-78.15.0/work/build'
make[1]: *** [/var/tmp/portage/dev-lang/spidermonkey-78.15.0/work/firefox-78.15.0/config/recurse.mk:34: compile] Error 2
make[1]: Leaving directory '/var/tmp/portage/dev-lang/spidermonkey-78.15.0/work/build'
make: *** [/var/tmp/portage/dev-lang/spidermonkey-78.15.0/work/firefox-78.15.0/config/rules.mk:392: default] Error 2
 * ERROR: dev-lang/spidermonkey-78.15.0::gentoo failed (compile phase):
Comment 1 ernsteiswuerfel archtester 2021-12-02 00:17:40 UTC
Created attachment 757159 [details]
emerge --info