Gentoo Websites Logo
Go to: Gentoo Home Documentation Forums Lists Bugs Planet Store Wiki Get Gentoo!
Bug 806511 - dev-lang/tcc-0.9.27 - bcheck.c:738: error: _malloc_hook undeclared
Summary: dev-lang/tcc-0.9.27 - bcheck.c:738: error: _malloc_hook undeclared
Status: RESOLVED FIXED
Alias: None
Product: Gentoo Linux
Classification: Unclassified
Component: Current packages (show other bugs)
Hardware: All Linux
: Normal normal (vote)
Assignee: Yixun Lan
URL:
Whiteboard:
Keywords:
Depends on:
Blocks: glibc-2.34
  Show dependency tree
 
Reported: 2021-08-05 13:15 UTC by Toralf Förster
Modified: 2021-10-25 12:35 UTC (History)
0 users

See Also:
Package list:
Runtime testing required: ---


Attachments
emerge-info.txt (emerge-info.txt,16.86 KB, text/plain)
2021-08-05 13:15 UTC, Toralf Förster
Details
dev-lang:tcc-0.9.27:20210805-095052.log (dev-lang:tcc-0.9.27:20210805-095052.log,5.52 KB, text/plain)
2021-08-05 13:15 UTC, Toralf Förster
Details
emerge-history.txt (emerge-history.txt,209.63 KB, text/plain)
2021-08-05 13:15 UTC, Toralf Förster
Details
environment (environment,49.79 KB, text/plain)
2021-08-05 13:15 UTC, Toralf Förster
Details
etc.portage.tar.bz2 (etc.portage.tar.bz2,16.61 KB, application/x-bzip)
2021-08-05 13:15 UTC, Toralf Förster
Details
temp.tar.bz2 (temp.tar.bz2,13.64 KB, application/x-bzip)
2021-08-05 13:15 UTC, Toralf Förster
Details

Note You need to log in before you can comment on or make changes to this bug.
Description Toralf Förster gentoo-dev 2021-08-05 13:15:07 UTC
../tcc -c va_list.c -o va_list.o -B..
../tcc -c bcheck.c -o bcheck.o -B..
bcheck.c:738: error: '__malloc_hook' undeclared
make[1]: *** [Makefile:64: bcheck.o] Error 1
make[1]: Leaving directory '/var/tmp/portage/dev-lang/tcc-0.9.27/work/tcc-0.9.27/lib'
make: *** [Makefile:230: libtcc1.a] Error 2
make: *** Waiting for unfinished jobs....

  -------------------------------------------------------------------

  This is an unstable amd64 chroot image at a tinderbox (==build bot)
  name: 17.1_no_multilib_hardened-j3-20210803-215352

  -------------------------------------------------------------------

gcc-config -l:
 [1] x86_64-pc-linux-gnu-11.2.0 *
clang version 12.0.1
Target: x86_64-pc-linux-gnu
Thread model: posix
InstalledDir: /usr/lib/llvm/12/bin
/usr/lib/llvm/12
12.0.1
Python 3.9.6
Available Ruby profiles:
  [1]   ruby26 (with Rubygems)
  [2]   ruby30 (with Rubygems) *
Available Rust versions:
  [1]   rust-bin-1.54.0 *
The following VMs are available for generation-2:
*)	AdoptOpenJDK JRE 8.292_p10 [openjdk-jre-bin-8]
Available Java Virtual Machines:
  [1]   openjdk-jre-bin-8  system-vm

The Glorious Glasgow Haskell Compilation System, version 8.10.4

  HEAD of ::gentoo
commit 4b78523d4cc5f6263f505a1247d0cabcea5db2b2
Merge: deed36d1c0f 505819c9621
Author: Repository mirror & CI <repomirrorci@gentoo.org>
Date:   Thu Aug 5 08:51:34 2021 +0000

    Merge updates from master

emerge -qpvO dev-lang/tcc
[ebuild  N    ] dev-lang/tcc-0.9.27  USE="-test"
Comment 1 Toralf Förster gentoo-dev 2021-08-05 13:15:08 UTC
Created attachment 730314 [details]
emerge-info.txt
Comment 2 Toralf Förster gentoo-dev 2021-08-05 13:15:09 UTC
Created attachment 730317 [details]
dev-lang:tcc-0.9.27:20210805-095052.log
Comment 3 Toralf Förster gentoo-dev 2021-08-05 13:15:11 UTC
Created attachment 730320 [details]
emerge-history.txt
Comment 4 Toralf Förster gentoo-dev 2021-08-05 13:15:12 UTC
Created attachment 730323 [details]
environment
Comment 5 Toralf Förster gentoo-dev 2021-08-05 13:15:14 UTC
Created attachment 730326 [details]
etc.portage.tar.bz2
Comment 6 Toralf Förster gentoo-dev 2021-08-05 13:15:15 UTC
Created attachment 730329 [details]
temp.tar.bz2
Comment 7 Larry the Git Cow gentoo-dev 2021-10-25 12:35:28 UTC
The bug has been closed via the following commit(s):

https://gitweb.gentoo.org/repo/gentoo.git/commit/?id=717eba5b5cfb78b1438c348882b34c88b3dc173a

commit 717eba5b5cfb78b1438c348882b34c88b3dc173a
Author:     Sam James <sam@gentoo.org>
AuthorDate: 2021-10-25 12:34:24 +0000
Commit:     Sam James <sam@gentoo.org>
CommitDate: 2021-10-25 12:35:11 +0000

    dev-lang/tcc: add 0.9.27_p20211022 (glibc-2.34, security fixes)
    
    Upstream development seems to just be rolling now too.
    
    Closes: https://bugs.gentoo.org/806511
    Bug: https://bugs.gentoo.org/737092
    Bug: https://bugs.gentoo.org/715428
    Bug: https://bugs.gentoo.org/765652
    Bug: https://bugs.gentoo.org/687114
    Signed-off-by: Sam James <sam@gentoo.org>

 dev-lang/tcc/Manifest                    |  1 +
 dev-lang/tcc/tcc-0.9.27_p20211022.ebuild | 80 ++++++++++++++++++++++++++++++++
 dev-lang/tcc/tcc-9999.ebuild             | 43 ++++++++++-------
 3 files changed, 106 insertions(+), 18 deletions(-)