Gentoo Websites Logo
Go to: Gentoo Home Documentation Forums Lists Bugs Planet Store Wiki Get Gentoo!
Bug 778365 - dev-python/sqlalchemy-1.4.3 fails tests
Summary: dev-python/sqlalchemy-1.4.3 fails tests
Status: CONFIRMED
Alias: None
Product: Gentoo Linux
Classification: Unclassified
Component: Current packages (show other bugs)
Hardware: All Linux
: Normal normal (vote)
Assignee: Python Gentoo Team
URL:
Whiteboard:
Keywords:
Depends on:
Blocks:
 
Reported: 2021-03-26 11:22 UTC by Agostino Sarubbo
Modified: 2021-12-20 12:43 UTC (History)
1 user (show)

See Also:
Package list:
Runtime testing required: ---


Attachments
build.log.xz (build.log.xz,362.94 KB, application/x-xz)
2021-03-26 11:22 UTC, Agostino Sarubbo
Details

Note You need to log in before you can comment on or make changes to this bug.
Description Agostino Sarubbo gentoo-dev 2021-03-26 11:22:38 UTC
https://blogs.gentoo.org/ago/2020/07/04/gentoo-tinderbox/

Issue: dev-python/sqlalchemy-1.4.3 fails tests.
Discovered on: amd64 (internal ref: ci)
Comment 1 Agostino Sarubbo gentoo-dev 2021-03-26 11:22:50 UTC
Created attachment 694092 [details]
build.log.xz

build log and emerge --info (compressed because it exceeds attachment limit, use 'xzless' to read it)
Comment 2 Rolf Eike Beer archtester 2021-12-20 12:43:03 UTC
FAILED test/base/test_concurrency_py3k.py::TestAsyncAdaptedQueue::test_lazy_init
FAILED test/base/test_concurrency_py3k.py::TestAsyncioCompat::test_await_fallback_error
FAILED test/base/test_concurrency_py3k.py::TestAsyncAdaptedQueue::test_error_other_loop
FAILED test/base/test_concurrency_py3k.py::TestAsyncioCompat::test_sync_error
FAILED test/base/test_concurrency_py3k.py::TestAsyncioCompat::test_await_only_error
FAILED test/base/test_concurrency_py3k.py::TestAsyncioCompat::test_ok - Value...
FAILED test/base/test_concurrency_py3k.py::TestAsyncioCompat::test_await_only_no_greenlet
FAILED test/base/test_concurrency_py3k.py::TestAsyncioCompat::test_require_await
FAILED test/base/test_concurrency_py3k.py::TestAsyncioCompat::test_contextvars
FAILED test/ext/asyncio/test_engine_py3k.py::TextSyncDBAPI::test_sync_driver_execution[<lambda>0]
FAILED test/ext/asyncio/test_engine_py3k.py::TextSyncDBAPI::test_sync_driver_execution[<lambda>1]
FAILED test/ext/asyncio/test_engine_py3k.py::TextSyncDBAPI::test_sync_driver_execution[<lambda>2]
FAILED test/ext/asyncio/test_engine_py3k.py::TextSyncDBAPI::test_sync_driver_run_sync
FAILED test/engine/test_pool.py::PoolEventsTest::test_checkin_event_gc[True-_exclusions0]
FAILED test/base/test_concurrency_py3k.py::TestAsyncioCompat::test_async_error
FAILED test/engine/test_pool.py::QueuePoolTest::test_userspace_disconnectionerror_weakref_finalizer[True-_exclusions0]
========== 16 failed, 12727 passed, 1683 skipped in 60.43s (0:01:00) ===========