Gentoo Websites Logo
Go to: Gentoo Home Documentation Forums Lists Bugs Planet Store Wiki Get Gentoo!
Bug 776949 - dev-python/scipy-1.6.0 - fails 14 tests
Summary: dev-python/scipy-1.6.0 - fails 14 tests
Status: UNCONFIRMED
Alias: None
Product: Gentoo Linux
Classification: Unclassified
Component: Current packages (show other bugs)
Hardware: PPC64 Linux
: Normal normal (vote)
Assignee: Gentoo Science Related Packages
URL:
Whiteboard:
Keywords: TESTFAILURE
Depends on:
Blocks:
 
Reported: 2021-03-17 15:48 UTC by ernsteiswuerfel
Modified: 2021-05-06 22:33 UTC (History)
2 users (show)

See Also:
Package list:
Runtime testing required: ---


Attachments
build.log.xz (scipy-1.6.0:20210317-020837.log.xz,192.24 KB, application/x-xz)
2021-03-17 15:48 UTC, ernsteiswuerfel
Details
emerge --info (file_776949.txt,5.94 KB, text/plain)
2021-03-17 15:49 UTC, ernsteiswuerfel
Details

Note You need to log in before you can comment on or make changes to this bug.
Description ernsteiswuerfel 2021-03-17 15:48:45 UTC
Created attachment 692142 [details]
build.log.xz

[...]
======================================= short test summary info ========================================
FAILED scipy/io/arff/tests/test_arffread.py::TestNoData::test_nodata - AssertionError: 
FAILED scipy/io/tests/test_fortran.py::test_fortranfile_read_mixed_record - AssertionError: 
FAILED scipy/io/tests/test_wavfile.py::test_24_bit_odd_size_with_pad - AssertionError: 
FAILED scipy/io/tests/test_wavfile.py::test_20_bit_extra_data - AssertionError: 
FAILED scipy/io/tests/test_wavfile.py::test_36_bit_odd_size - AssertionError: 
FAILED scipy/io/tests/test_wavfile.py::test_45_bit_even_size - AssertionError: 
FAILED scipy/io/tests/test_wavfile.py::test_53_bit_odd_size - AssertionError: 
FAILED scipy/stats/tests/test_kdeoth.py::test_kde_1d - AssertionError
FAILED scipy/stats/tests/test_kdeoth.py::test_kde_1d_weighted - AssertionError
FAILED scipy/stats/tests/test_kdeoth.py::test_gaussian_kde_subclassing - AssertionError: 
FAILED scipy/stats/tests/test_kdeoth.py::test_gaussian_kde_covariance_caching - AssertionError: 
FAILED scipy/stats/tests/test_kdeoth.py::test_kde_integer_input - AssertionError: 
FAILED scipy/stats/tests/test_kdeoth.py::test_pdf_logpdf - AssertionError: 
FAILED scipy/stats/tests/test_kdeoth.py::test_pdf_logpdf_weighted - AssertionError: 
= 14 failed, 30510 passed, 2055 skipped, 10989 deselected, 77 xfailed, 5 xpassed in 1243.98s (0:20:43) =
 * ERROR: dev-python/scipy-1.6.0::gentoo failed (test phase):
 *   Tests fail with python3.8
Comment 1 ernsteiswuerfel 2021-03-17 15:49:14 UTC
Created attachment 692145 [details]
emerge --info