Gentoo Websites Logo
Go to: Gentoo Home Documentation Forums Lists Bugs Planet Store Wiki Get Gentoo!
Bug 76660 - media-video/lives-0.9.1 emerge failed
Summary: media-video/lives-0.9.1 emerge failed
Alias: None
Product: Gentoo Linux
Classification: Unclassified
Component: Current packages (show other bugs)
Hardware: AMD64 Linux
: High blocker (vote)
Assignee: Gentoo Media-video project
Depends on:
Reported: 2005-01-04 09:50 UTC by Alexey Maximov
Modified: 2005-06-04 08:43 UTC (History)
0 users

See Also:
Package list:
Runtime testing required: ---

emerge info (emerge_info.txt,2.59 KB, text/plain)
2005-01-04 09:51 UTC, Alexey Maximov
emerge log file (4909-lives-0.9.1.log,72.78 KB, text/x-log)
2005-01-04 09:52 UTC, Alexey Maximov

Note You need to log in before you can comment on or make changes to this bug.
Description Alexey Maximov 2005-01-04 09:50:52 UTC
86_64-pc-linux-gnu-gcc -march=athlon64 -O2 -pipe -fomit-frame-pointer -Wall -o yuv4mpeg_stream -shared -Wl,--export-dynamic yuv4mpeg_stream-yuv4mpeg_stream.o  -L//usr/lib64 /usr/lib64/ /usr/lib64/ /usr/lib64/ /usr/lib64/ /usr/lib64/ /usr/lib64/ /usr/lib64/ -lm /usr/lib64/ /usr/lib64/ -ldl /usr/lib64/ /usr/lib64/
/usr/lib/gcc/x86_64-pc-linux-gnu/3.4.3/../../../../x86_64-pc-linux-gnu/bin/ld: yuv4mpeg_stream-yuv4mpeg_stream.o: relocation R_X86_64_32S against `render_frame_unknown' can not be used when making a shared object; recompile with -fPIC
yuv4mpeg_stream-yuv4mpeg_stream.o: could not read symbols: Bad value
collect2: ld returned 1 exit status
make[4]: *** [yuv4mpeg_stream] Error 1
make[4]: Leaving directory `/var/tmp/portage/lives-0.9.1/work/LiVES-0.9.1/lives-plugins/plugins/playback/video'
make[3]: *** [all-recursive] Error 1
make[3]: Leaving directory `/var/tmp/portage/lives-0.9.1/work/LiVES-0.9.1/lives-plugins/plugins/playback'
make[2]: *** [all-recursive] Error 1
make[2]: Leaving directory `/var/tmp/portage/lives-0.9.1/work/LiVES-0.9.1/lives-plugins/plugins'
make[1]: *** [all-recursive] Error 1
make[1]: Leaving directory `/var/tmp/portage/lives-0.9.1/work/LiVES-0.9.1/lives-plugins'
make: *** [all-recursive] Error 1

!!! ERROR: media-video/lives-0.9.1 failed.
!!! Function src_compile, Line 49, Exitcode 2
!!! (no error message)
!!! If you need support, post the topmost build error, NOT this status message.
Comment 1 Alexey Maximov 2005-01-04 09:51:15 UTC
Created attachment 47612 [details]
emerge info
Comment 2 Alexey Maximov 2005-01-04 09:52:02 UTC
Created attachment 47613 [details]
emerge log file
Comment 3 Alastair Murray 2005-01-08 05:37:12 UTC
I also found this problem (bug #75945), you can find a patch to the ebuild which worked for me there.
Comment 4 Jan Brinkmann (RETIRED) gentoo-dev 2005-01-08 10:19:39 UTC

*** This bug has been marked as a duplicate of 75945 ***
Comment 5 Daniel Webert 2005-06-04 08:43:01 UTC
closing wrt bugzilla-update