Gentoo Websites Logo
Go to: Gentoo Home Documentation Forums Lists Bugs Planet Store Wiki Get Gentoo!
Bug 762721 - gnustep-base/gnustep-base-1.27.0: test failures
Summary: gnustep-base/gnustep-base-1.27.0: test failures
Status: CONFIRMED
Alias: None
Product: Gentoo Linux
Classification: Unclassified
Component: Current packages (show other bugs)
Hardware: All Linux
: Normal normal (vote)
Assignee: Gnustep herd
URL:
Whiteboard:
Keywords: TESTFAILURE
: 635762 (view as bug list)
Depends on:
Blocks: 761070
  Show dependency tree
 
Reported: 2020-12-31 04:18 UTC by Sam James
Modified: 2021-01-02 17:12 UTC (History)
1 user (show)

See Also:
Package list:
Runtime testing required: ---


Attachments
build.log (file_762721.txt,514.72 KB, text/plain)
2020-12-31 04:18 UTC, Sam James
Details
tests.log.xz (tests.log.xz,61.37 KB, application/x-xz)
2020-12-31 04:22 UTC, Sam James
Details

Note You need to log in before you can comment on or make changes to this bug.
Description Sam James archtester Gentoo Infrastructure gentoo-dev Security 2020-12-31 04:18:35 UTC
Created attachment 680341 [details]
build.log

7921 Passed tests
     39 Dashed hopes
     14 Failed tests
     13 Skipped sets
     12 Failed files


Some testing was abandoned when a test program aborted.  This is
generally a severe problem and may mean that the package is
completely unusable.  You need to try to fix this and, if it is
not due to some problem on your system, please help by submitting
a patch (or at least a bug report) to the package maintainer.

One or more tests failed.  None of them should have.
Please submit a patch to fix the problem or send a bug report to
the package maintainer.
Please see /var/tmp/portage/gnustep-base/gnustep-base-1.27.0/work/gnustep-base-1.27.0/Tests/tests.log for more detail.
gmake[1]: *** [GNUmakefile:61: check] Error 1
make: *** [/usr/share/GNUstep/Makefiles/Master/serial-subdirectories.make:53: internal-check] Error 2
 * ERROR: gnustep-base/gnustep-base-1.27.0::gentoo failed (test phase):

----
Portage 3.0.9 (python 3.8.6-final-0, default/linux/amd64/17.1/desktop, gcc-9.3.0, glibc-2.32-r3, 4.14.34-gentoo-infra38 x86_64)
=================================================================
System uname: Linux-4.14.34-gentoo-infra38-x86_64-Intel-R-_Xeon-R-_CPU_E5-2620_v4_@_2.10GHz-with-glibc2.2.5
KiB Mem:    16426740 total,   6410948 free
KiB Swap:    4194268 total,   4178908 free
Timestamp of repository gentoo: Thu, 31 Dec 2020 03:35:24 +0000
sh bash 5.0_p18
ld GNU ld (Gentoo 2.34 p6) 2.34.0
ccache version 4.1 [disabled]
app-shells/bash:          5.0_p18::gentoo
dev-lang/perl:            5.30.3::gentoo
dev-lang/python:          2.7.18-r5::gentoo, 3.6.12-r1::gentoo, 3.7.9-r1::gentoo, 3.8.6-r1::gentoo, 3.9.0-r1::gentoo
dev-util/ccache:          4.1::gentoo
dev-util/cmake:           3.17.4-r1::gentoo
sys-apps/baselayout:      2.7::gentoo
sys-apps/openrc:          0.42.1::gentoo
sys-apps/sandbox:         2.20::gentoo
sys-devel/autoconf:       2.13-r1::gentoo, 2.69-r5::gentoo
sys-devel/automake:       1.16.2-r1::gentoo
sys-devel/binutils:       2.34-r2::gentoo
sys-devel/gcc:            9.3.0-r2::gentoo
sys-devel/gcc-config:     2.3.2-r1::gentoo
sys-devel/libtool:        2.4.6-r6::gentoo
sys-devel/make:           4.3::gentoo
sys-kernel/linux-headers: 5.4-r1::gentoo (virtual/os-headers)
sys-libs/glibc:           2.32-r3::gentoo
Repositories:

gentoo
    location: /bound/portage
    sync-type: rsync
    sync-uri: rsync://rsync.gentoo.org/gentoo-portage
    priority: -1000
    sync-rsync-verify-metamanifest: yes
    sync-rsync-extra-opts:
    sync-rsync-verify-max-age: 24
    sync-rsync-verify-jobs: 1

ACCEPT_KEYWORDS="amd64"
ACCEPT_LICENSE="@FREE"
CBUILD="x86_64-pc-linux-gnu"
CFLAGS="-O2 -pipe -march=native -fdiagnostics-show-option -frecord-gcc-switches"
CHOST="x86_64-pc-linux-gnu"
CONFIG_PROTECT="/etc /usr/share/config /usr/share/gnupg/qualified.txt"
CONFIG_PROTECT_MASK="/etc/ca-certificates.conf /etc/dconf /etc/env.d /etc/fonts/fonts.conf /etc/gconf /etc/gentoo-release /etc/revdep-rebuild /etc/sandbox.d /etc/terminfo /etc/texmf/language.dat.d /etc/texmf/language.def.d /etc/texmf/updmap.d /etc/texmf/web2c"
CXXFLAGS="-O2 -pipe -march=native"
DISTDIR="/bound/distfiles"
EMERGE_DEFAULT_OPTS="--complete-graph --with-bdeps=y --keep-going --deep"
ENV_UNSET="CARGO_HOME DBUS_SESSION_BUS_ADDRESS DISPLAY GOBIN GOPATH PERL5LIB PERL5OPT PERLPREFIX PERL_CORE PERL_MB_OPT PERL_MM_OPT XAUTHORITY XDG_CACHE_HOME XDG_CONFIG_HOME XDG_DATA_HOME XDG_RUNTIME_DIR"
FCFLAGS="-O2 -pipe -march=native"
FEATURES="assume-digests binpkg-docompress binpkg-dostrip binpkg-logs config-protect-if-modified distlocks ebuild-locks fixlafiles ipc-sandbox merge-sync multilib-strict network-sandbox news parallel-fetch pid-sandbox preserve-libs protect-owned qa-unresolved-soname-deps sandbox sfperms strict unknown-features-warn unmerge-logs unmerge-orphans userfetch userpriv usersandbox usersync xattr"
FFLAGS="-O2 -pipe -march=native"
GENTOO_MIRRORS="http://distfiles.gentoo.org"
LANG="en_US.utf8"
LDFLAGS="-Wl,-O1 -Wl,--as-needed -Wl,--hash-style=gnu"
MAKEOPTS="-j9 -l9"
PKGDIR="/var/cache/binpkgs"
PORTAGE_CONFIGROOT="/"
PORTAGE_RSYNC_OPTS="--recursive --links --safe-links --perms --times --omit-dir-times --compress --force --whole-file --delete --stats --human-readable --timeout=180 --exclude=/distfiles --exclude=/local --exclude=/packages --exclude=/.git"
PORTAGE_TMPDIR="/var/tmp"
USE="X a52 aac acl acpi alsa amd64 asm berkdb bluetooth branding bzip2 cairo caps cdda cdr cli crypt cups dbus dri dts dvd dvdr egl elogind emboss encode exif filecaps flac fortran gdbm gif gles2 gmp gpm graphite gtk gui iconv icu introspection ipv6 jit jpeg lcms libglvnd libnotify libtirpc mad mng mp3 mp4 mpeg multilib ncurses nls nptl objc ogg opengl openmp pam pango pcre pdf png policykit polkit ppds pulseaudio qt5 readline sdl seccomp spell split-usr ssl startup-notification svg tcpd threads tiff truetype udev udisks unicode upower usb vorbis wayland wxwidgets x264 xattr xcb xml xv xvid xwayland zlib" ABI_X86="32 64" ADA_TARGET="gnat_2018" ALSA_CARDS="ali5451 als4000 atiixp atiixp-modem bt87x ca0106 cmipci emu10k1x ens1370 ens1371 es1938 es1968 fm801 hda-intel intel8x0 intel8x0m maestro3 trident usb-audio via82xx via82xx-modem ymfpci" APACHE2_MODULES="authn_core authz_core socache_shmcb unixd actions alias auth_basic authn_alias authn_anon authn_dbm authn_default authn_file authz_dbm authz_default authz_groupfile authz_host authz_owner authz_user autoindex cache cgi cgid dav dav_fs dav_lock deflate dir disk_cache env expires ext_filter file_cache filter headers include info log_config logio mem_cache mime mime_magic negotiation rewrite setenvif speling status unique_id userdir usertrack vhost_alias" CALLIGRA_FEATURES="karbon sheets words" COLLECTD_PLUGINS="df interface irq load memory rrdtool swap syslog" CPU_FLAGS_X86="aes avx avx2 f16c fma3 mmx mmxext pclmul popcnt sse sse2 sse3 sse4_1 sse4_2 ssse3" ELIBC="glibc" GPSD_PROTOCOLS="ashtech aivdm earthmate evermore fv18 garmin garmintxt gpsclock greis isync itrax mtk3301 nmea ntrip navcom oceanserver oldstyle oncore rtcm104v2 rtcm104v3 sirf skytraq superstar2 timing tsip tripmate tnt ublox ubx" INPUT_DEVICES="libinput" KERNEL="linux" LCD_DEVICES="framebuffer" LIBREOFFICE_EXTENSIONS="presenter-console presenter-minimizer" LUA_SINGLE_TARGET="lua5-1" LUA_TARGETS="lua5-1" OFFICE_IMPLEMENTATION="libreoffice" PHP_TARGETS="php7-2 php7-3 php7-4" POSTGRES_TARGETS="postgres10 postgres11" PYTHON_SINGLE_TARGET="python3_8" PYTHON_TARGETS="python2_7 python3_8 python3_6 python3_7 python3_9" RUBY_TARGETS="ruby25 ruby26" USERLAND="GNU" VIDEO_CARDS="amdgpu fbdev intel nouveau radeon radeonsi vesa dummy v4l" XTABLES_ADDONS="quota2 psd pknock lscan length2 ipv4options ipset ipp2p iface geoip fuzzy condition tee tarpit sysrq steal rawnat logmark ipmark dhcpmac delude chaos account"
Unset:  CC, CPPFLAGS, CTARGET, CXX, INSTALL_MASK, LC_ALL, LINGUAS, PORTAGE_BINHOST, PORTAGE_BUNZIP2_COMMAND, PORTAGE_COMPRESS, PORTAGE_COMPRESS_FLAGS, PORTAGE_RSYNC_EXTRA_OPTS
Comment 1 Sam James archtester Gentoo Infrastructure gentoo-dev Security 2020-12-31 04:22:54 UTC
Created attachment 680344 [details]
tests.log.xz

The failures here (to an untrained eye in GNUstep) look network-sandbox and TMPDIR related:

$ grep -rsin "Failed:" tests.log -A 2 -B 2
tests.log-3650-2020-12-31 04:12:43.316 general[6326:6326] File NSPathUtilities.m: 2034. In NSTemporaryDirectory Temporary directory (GNUmakefile base) does not exist
tests.log-3651-2020-12-31 04:12:43.316 general[6326:6326] part of the path to the lock file '(null)' is missing
tests.log:3652:2020-12-31 04:12:43.316 general[6326:6326] MethodSignature Test Failed:
tests.log-3653-2020-12-31 04:12:43.316 general[6326:6326] NSGenericException Failed to lock names for NSMessagePortNameServer (null)
tests.log-3654-Completed file:  general.m
--
--
tests.log-10861-2020-12-31 04:15:04.698 test00[12600:12600] Host 'www.gnustep.org' not found using 'gethostbyname()' - perhaps the hostname is wrong or networking is not set up on your machine
tests.log-10862-2020-12-31 04:15:04.699 test00[12600:12600] bad address-service-protocol combination
tests.log:10863:2020-12-31 04:15:04.699 test00[12600:12600] Load failed: further tests may fail.  Reason: Unable to connect to www.gnustep.org:80 ... No such file or directory
tests.log-10864-Failed test:     test00.m:120 ... URLHandleResourceDidBeginLoading called
tests.log-10865-Completed file:  test00.m
Comment 2 Bernard Cafarelli gentoo-dev 2021-01-02 16:20:07 UTC
*** Bug 635762 has been marked as a duplicate of this bug. ***
Comment 3 Bernard Cafarelli gentoo-dev 2021-01-02 17:12:46 UTC
Good recap from what I checked so far, indeed we have some network-related tests that fail, and some issue with temp dir issued by NSTemporaryDirectory()

First series, I have not found how to easily disable such tests (except removing the source code for it)
Second series, somehow with sandbox this part in Source/NSPathUtilities.m:
      NSDictionary  *env = [[NSProcessInfo processInfo] environment];

      baseTempDirName = [env objectForKey: @"TEMP"];

will return the listing of Tests dir ("GNUmakefile base" first, then showing the test result files)

I guess sandbox messes with the environment get call and that results in incorrect TEMP key. Hard to fix as this code is not in test but in main library.

Anyway at least both series are not blocking stabilization, and relevant tests passed when run as normal user