Gentoo Websites Logo
Go to: Gentoo Home Documentation Forums Lists Bugs Planet Store Wiki Get Gentoo!
Bug 760932 - sys-cluster/mpich-3.0.4 - fails 2 tests
Summary: sys-cluster/mpich-3.0.4 - fails 2 tests
Status: UNCONFIRMED
Alias: None
Product: Gentoo Linux
Classification: Unclassified
Component: Current packages (show other bugs)
Hardware: PPC64 Linux
: Normal normal (vote)
Assignee: Gentoo Cluster Team
URL:
Whiteboard:
Keywords: TESTFAILURE
Depends on:
Blocks:
 
Reported: 2020-12-20 22:45 UTC by ernsteiswuerfel
Modified: 2020-12-22 04:41 UTC (History)
1 user (show)

See Also:
Package list:
Runtime testing required: ---


Attachments
build.log (mpich-3.0.4:20201220-222620.log.xz,68.56 KB, application/x-xz)
2020-12-20 22:45 UTC, ernsteiswuerfel
Details
emerge --info (file_760932.txt,5.79 KB, text/plain)
2020-12-20 22:45 UTC, ernsteiswuerfel
Details

Note You need to log in before you can comment on or make changes to this bug.
Description ernsteiswuerfel 2020-12-20 22:45:26 UTC
Created attachment 678993 [details]
build.log

[...]
Testing integer LL/SC ABA with 2 threads                                  Unexpected success of OPA_SC_i
nt
*FAILED*
        at test_primitives.c:3949 in test_threaded_llsc_int_aba()...
    False positives: 91 / 999418
Testing pointer LL/SC ABA with 2 threads                                  Unexpected success of OPA_SC_p
tr
    Unexpected success of OPA_SC_ptr
    Unexpected success of OPA_SC_ptr
    Unexpected success of OPA_SC_ptr
    Unexpected success of OPA_SC_ptr
    Unexpected success of OPA_SC_ptr
    Unexpected success of OPA_SC_ptr
    Unexpected success of OPA_SC_ptr
    Unexpected success of OPA_SC_ptr
    Unexpected success of OPA_SC_ptr
    Unexpected success of OPA_SC_ptr
    Unexpected success of OPA_SC_ptr
    Unexpected success of OPA_SC_ptr
    Unexpected success of OPA_SC_ptr
    Unexpected success of OPA_SC_ptr
    Unexpected success of OPA_SC_ptr
    Unexpected success of OPA_SC_ptr
    Unexpected success of OPA_SC_ptr
    Unexpected success of OPA_SC_ptr
    Unexpected success of OPA_SC_ptr
    Unexpected success of OPA_SC_ptr
    Suppressing further output...
*FAILED*
        at test_primitives.c:4178 in test_threaded_llsc_ptr_aba()...
    False positives: 177 / 999333
[...]
***** 2 PRIMITIVES TESTS FAILED! *****
FAIL: test_primitives
Comment 1 ernsteiswuerfel 2020-12-20 22:45:47 UTC
Created attachment 678996 [details]
emerge --info