Gentoo Websites Logo
Go to: Gentoo Home Documentation Forums Lists Bugs Planet Store Wiki Get Gentoo!
Bug 753302 - dev-lang/python-3.9.0 fails test_ctypes test
Summary: dev-lang/python-3.9.0 fails test_ctypes test
Status: UNCONFIRMED
Alias: None
Product: Gentoo Linux
Classification: Unclassified
Component: Current packages (show other bugs)
Hardware: All Linux
: Normal normal (vote)
Assignee: Python Gentoo Team
URL:
Whiteboard:
Keywords: TESTFAILURE
Depends on:
Blocks:
 
Reported: 2020-11-06 11:04 UTC by Paolo Pedroni
Modified: 2021-06-29 20:53 UTC (History)
1 user (show)

See Also:
Package list:
Runtime testing required: ---


Attachments
python-3.9.0:20201106-105038.log.gz (python-3.9.0:20201106-105038.log.gz,46.18 KB, application/gzip)
2020-11-06 11:04 UTC, Paolo Pedroni
Details

Note You need to log in before you can comment on or make changes to this bug.
Description Paolo Pedroni 2020-11-06 11:04:05 UTC
Created attachment 670178 [details]
python-3.9.0:20201106-105038.log.gz

0:01:03 load avg: 3.34 [217/424/1] test_ctypes failed -- running: test_multiprocessing_fork (45.6 sec)
test test_ctypes failed -- Traceback (most recent call last):
  File "/var/tmp/portage/dev-lang/python-3.9.0/work/Python-3.9.0/Lib/ctypes/test/test_find.py", line 112, in test_find_on_libpath
    self.assertEqual(find_library(libname), 'lib%s.so' % libname)
AssertionError: None != 'libpy_ctypes_test_dummy.so'
[...]
== Tests result: FAILURE ==

398 tests OK.

1 test failed:
    test_ctypes

25 tests skipped:
    test_curses test_devpoll test_idle test_ioctl test_kqueue
    test_msilib test_nis test_ossaudiodev test_smtpnet
    test_socketserver test_startfile test_tcl test_timeout test_tix
    test_tk test_ttk_guionly test_ttk_textonly test_turtle
    test_urllib2net test_urllibnet test_winconsoleio test_winreg
    test_winsound test_xmlrpc_net test_zipfile64
0:04:10 load avg: 0.98
0:04:10 load avg: 0.98 Re-running failed tests in verbose mode
0:04:10 load avg: 0.98 Re-running test_ctypes in verbose mode
[...]
test_find_on_libpath (ctypes.test.test_find.LibPathFindTest) ... FAIL
[...]

======================================================================
FAIL: test_find_on_libpath (ctypes.test.test_find.LibPathFindTest)
----------------------------------------------------------------------
Traceback (most recent call last):
  File "/var/tmp/portage/dev-lang/python-3.9.0/work/Python-3.9.0/Lib/ctypes/test/test_find.py", line 112, in test_find_on_libpath
    self.assertEqual(find_library(libname), 'lib%s.so' % libname)
AssertionError: None != 'libpy_ctypes_test_dummy.so'

----------------------------------------------------------------------

Ran 489 tests in 0.464s

FAILED (failures=1, skipped=88)
test test_ctypes failed
1 test failed again:
    test_ctypes

== Tests result: FAILURE then FAILURE ==

398 tests OK.

1 test failed:
    test_ctypes

25 tests skipped:
    test_curses test_devpoll test_idle test_ioctl test_kqueue
    test_msilib test_nis test_ossaudiodev test_smtpnet
    test_socketserver test_startfile test_tcl test_timeout test_tix
    test_tk test_ttk_guionly test_ttk_textonly test_turtle
    test_urllib2net test_urllibnet test_winconsoleio test_winreg
    test_winsound test_xmlrpc_net test_zipfile64

1 re-run test:
    test_ctypes

Total duration: 4 min 11 sec
Tests result: FAILURE then FAILURE

# emerge --info =dev-lang/python-3.9.0
Portage 3.0.8 (python 3.7.9-final-0, default/linux/amd64/17.1/desktop/plasma/systemd, gcc-9.3.0, glibc-2.32-r2, 5.8.18-gentoo x86_64)
=================================================================
                         System Settings
=================================================================
System uname: Linux-5.8.18-gentoo-x86_64-Intel-R-_Core-TM-_i5-8400_CPU_@_2.80GHz-with-gentoo-2.7
KiB Mem:    16057288 total,  10319512 free
KiB Swap:   16777212 total,  16721916 free
Timestamp of repository gentoo: Fri, 06 Nov 2020 08:00:01 +0000
Head commit of repository gentoo: 959ad173563bf849fbed9e9454d0561472a0cde5
sh dash 0.5.11.2
ld GNU gold (Gentoo 2.34 p6 2.34.0) 1.16
ccache version 3.7.12 [disabled]
app-shells/bash:          5.0_p18::gentoo
dev-java/java-config:     2.3.1::gentoo
dev-lang/perl:            5.30.3::gentoo
dev-lang/python:          2.7.18-r4::gentoo, 3.7.9::gentoo, 3.8.5::gentoo
dev-util/ccache:          3.7.12::gentoo
dev-util/cmake:           3.17.4-r1::gentoo
sys-apps/baselayout:      2.7::gentoo
sys-apps/sandbox:         2.20::gentoo
sys-devel/autoconf:       2.13-r1::gentoo, 2.69-r5::gentoo
sys-devel/automake:       1.16.1-r1::gentoo
sys-devel/binutils:       2.34-r2::gentoo
sys-devel/gcc:            9.3.0-r1::gentoo
sys-devel/gcc-config:     2.3.2::gentoo
sys-devel/libtool:        2.4.6-r6::gentoo
sys-devel/make:           4.2.1-r4::gentoo
sys-kernel/linux-headers: 5.4-r1::gentoo (virtual/os-headers)
sys-libs/glibc:           2.32-r2::gentoo
Repositories:

gentoo
    location: /usr/portage
    sync-type: rsync
    sync-uri: rsync://rsync.gentoo.org/gentoo-portage
    priority: -1000
    sync-rsync-verify-jobs: 1
    sync-rsync-verify-metamanifest: yes
    sync-rsync-verify-max-age: 24
    sync-rsync-extra-opts: 

x-portage
    location: /usr/local/portage
    masters: gentoo
    priority: 0

ACCEPT_KEYWORDS="amd64"
ACCEPT_LICENSE="* -@EULA"
CBUILD="x86_64-pc-linux-gnu"
CFLAGS="-O2 -pipe -frecord-gcc-switches -march=skylake -mabm -ftree-vectorize -flto=6"
CHOST="x86_64-pc-linux-gnu"
CONFIG_PROTECT="/etc /usr/lib64/libreoffice/program/sofficerc /usr/share/config /usr/share/gnupg/qualified.txt"
CONFIG_PROTECT_MASK="/etc/ca-certificates.conf /etc/dconf /etc/env.d /etc/fonts/fonts.conf /etc/gconf /etc/gentoo-release /etc/revdep-rebuild /etc/sandbox.d /etc/terminfo"
CXXFLAGS="-O2 -pipe -frecord-gcc-switches -march=skylake -mabm -ftree-vectorize -flto=6"
DISTDIR="/usr/portage/distfiles"
EMERGE_DEFAULT_OPTS="--keep-going y --with-bdeps y"
ENV_UNSET="CARGO_HOME DBUS_SESSION_BUS_ADDRESS DISPLAY GOBIN GOPATH PERL5LIB PERL5OPT PERLPREFIX PERL_CORE PERL_MB_OPT PERL_MM_OPT XAUTHORITY XDG_CACHE_HOME XDG_CONFIG_HOME XDG_DATA_HOME XDG_RUNTIME_DIR"
FCFLAGS="-O2 -pipe -frecord-gcc-switches -march=skylake -mabm -ftree-vectorize -flto=6"
FEATURES="assume-digests binpkg-docompress binpkg-dostrip binpkg-logs cgroup compress-build-logs config-protect-if-modified distlocks ebuild-locks ipc-sandbox merge-sync multilib-strict network-sandbox news parallel-fetch pid-sandbox preserve-libs protect-owned qa-unresolved-soname-deps sandbox sfperms sign split-elog split-log strict strict-keepdir test unknown-features-warn unmerge-logs unmerge-orphans userfetch userpriv usersandbox usersync xattr"
FFLAGS="-O2 -pipe -frecord-gcc-switches -march=skylake -mabm -ftree-vectorize -flto=6"
GENTOO_MIRRORS="http://mirrors.evowise.com/gentoo/ https://mirrors.evowise.com/gentoo/ http://mirror.eu.oneandone.net/linux/distributions/gentoo/gentoo/ http://mirror.netcologne.de/gentoo/"
LANG="it_IT.utf8"
LDFLAGS="-Wl,-O1 -Wl,--as-needed -Wl,--hash-style=gnu -Wl,--sort-common -flto=6"
LINGUAS="it it_IT"
MAKEOPTS="-j7 -l6"
PKGDIR="/var/cache/binpkgs"
PORTAGE_CONFIGROOT="/"
PORTAGE_RSYNC_OPTS="--recursive --links --safe-links --perms --times --omit-dir-times --compress --force --whole-file --delete --stats --human-readable --timeout=180 --exclude=/distfiles --exclude=/local --exclude=/packages --exclude=/.git"
PORTAGE_TMPDIR="/var/tmp"
USE="X a52 aac aalib acl acpi activities adns alsa amd64 ao audiofile bash-completion bluetooth branding brotli bzip2 cairo caps cdda cddb cdparanoia cdr cli crypt css cups curl dbus declarative dga djvu dri dts dvd dvdr emboss encode exif expat fbcon ffmpeg fftw flac fontconfig foomaticdb fortran ftp gd gdbm geoip gif gimp gmp gnutls gphoto2 gpm graphviz gtk gui handbook iconv icu idn imagemagick imlib introspection ipv6 java javascript jbig jemalloc jpeg jpeg2k kde kipi kwallet lame lcms libass libglvnd libnotify libsamplerate libtirpc lm_sensors lua lzma lzo mad mmap mng mp3 mp4 mpeg mplayer multilib musicbrainz ncurses nls nptl nsplugin offensive ogg openal opengl openmp pam pango pcre pdf phonon plasma png policykit postscript ppds pulseaudio qml qt5 rdesktop readline recode samba sctp sdl seccomp sndfile sockets speex spell split-usr sqlite ssl startup-notification svg symlink syslog systemd sysvipc taglib telemetry test theora threads tidy tiff truetype udev udisks unicode upower usb vaapi vala vim-syntax vnc vorbis wavpack wayland widgets win32codecs wmf wxwidgets x264 xattr xcb xine xml xpm xscreensaver xv xvid yahoo zlib zstd" ABI_X86="64" ADA_TARGET="gnat_2018" ALSA_CARDS="hda-intel virmidi" APACHE2_MODULES="authn_core authz_core socache_shmcb unixd actions alias auth_basic authn_alias authn_anon authn_dbm authn_default authn_file authz_dbm authz_default authz_groupfile authz_host authz_owner authz_user autoindex cache cgi cgid dav dav_fs dav_lock deflate dir disk_cache env expires ext_filter file_cache filter headers include info log_config logio mem_cache mime mime_magic negotiation rewrite setenvif speling status unique_id userdir usertrack vhost_alias" CALLIGRA_FEATURES="karbon sheets words" CAMERAS="kodak ptp2" COLLECTD_PLUGINS="df interface irq load memory rrdtool swap syslog" CPU_FLAGS_X86="aes avx avx2 f16c fma3 mmx mmxext pclmul popcnt rdrand sse sse2 sse3 sse4_1 sse4_2 ssse3" CURL_SSL="gnutls" ELIBC="glibc" GPSD_PROTOCOLS="ashtech aivdm earthmate evermore fv18 garmin garmintxt gpsclock greis isync itrax mtk3301 nmea ntrip navcom oceanserver oldstyle oncore rtcm104v2 rtcm104v3 sirf skytraq superstar2 timing tsip tripmate tnt ublox ubx" INPUT_DEVICES="libinput" KERNEL="linux" L10N="it en" LCD_DEVICES="bayrad cfontz cfontz633 glk hd44780 lb216 lcdm001 mtxorb ncurses text" LIBREOFFICE_EXTENSIONS="nlpsolver wiki-publisher" LUA_SINGLE_TARGET="lua5-1" LUA_TARGETS="lua5-1" OFFICE_IMPLEMENTATION="libreoffice" PHP_TARGETS="php7-2 php7-3 php7-4" POSTGRES_TARGETS="postgres10 postgres11" PYTHON_SINGLE_TARGET="python3_7" PYTHON_TARGETS="python3_7" RUBY_TARGETS="ruby25" USERLAND="GNU" VIDEO_CARDS="intel i965" XTABLES_ADDONS="quota2 psd pknock lscan length2 ipv4options ipset ipp2p iface geoip fuzzy condition tee tarpit sysrq steal rawnat logmark ipmark dhcpmac delude chaos account"
Unset:  CC, CPPFLAGS, CTARGET, CXX, INSTALL_MASK, LC_ALL, PORTAGE_BINHOST, PORTAGE_BUNZIP2_COMMAND, PORTAGE_COMPRESS, PORTAGE_COMPRESS_FLAGS, PORTAGE_RSYNC_EXTRA_OPTS

# emerge -1pqv =dev-lang/python-3.9.0
[ebuild  NS   ] dev-lang/python-3.9.0 [2.7.18-r4, 3.7.9, 3.8.5] USE="bluetooth gdbm ipv6 ncurses readline sqlite ssl test* xml -build -examples -hardened -libressl -tk -wininst"