Gentoo Websites Logo
Go to: Gentoo Home Documentation Forums Lists Bugs Planet Store Wiki Get Gentoo!
Bug 729916 - net-misc/ntp-4.2.8_p15 - ld: run-t-log.o:(.bss.progname+0x0): multiple definition of `progname'; t-log.o:(.bss.progname+0x0): first defined here
Summary: net-misc/ntp-4.2.8_p15 - ld: run-t-log.o:(.bss.progname+0x0): multiple defini...
Status: UNCONFIRMED
Alias: None
Product: Gentoo Linux
Classification: Unclassified
Component: Current packages (show other bugs)
Hardware: All Linux
: Normal normal (vote)
Assignee: Gentoo's Team for Core System packages
URL:
Whiteboard:
Keywords: TESTFAILURE
Depends on:
Blocks: -fno-common
  Show dependency tree
 
Reported: 2020-06-27 15:07 UTC by tka
Modified: 2020-06-28 14:41 UTC (History)
0 users

See Also:
Package list:
Runtime testing required: ---


Attachments
build.log (build.log,270.95 KB, text/plain)
2020-06-27 15:09 UTC, tka
Details

Note You need to log in before you can comment on or make changes to this bug.
Description tka 2020-06-27 15:07:54 UTC
/bin/sh ../libtool  --tag=CC   --mode=link x86_64-pc-linux-gnu-gcc -ffunction-sections -fdata-sections -Wall -Wcast-align -Wcast-qual -Wmissing-prototypes -Wpointer-arith -Wshadow -Winit-self -Wstrict-overflow    -Wno-strict-prototypes -fPIE -fPIC -fstack-protector-all -O1 -march=native -mtune=native -O2 -pipe  -pie -Wl,-z,relro -Wl,-z,now -Wl,-O1 -Wl,--as-needed -Wl,--hash-style=gnu -o test-log t-log.o run-t-log.o version.o  ../libsntp.a ../libopts/libopts.la -pthread -levent_pthreads -levent_core ../../libntp/libntp.a -Wl,--gc-sections  -lcap -lssl -lcrypto -ldl  ../unity/libunity.a -lm  
libtool: link: x86_64-pc-linux-gnu-gcc -ffunction-sections -fdata-sections -Wall -Wcast-align -Wcast-qual -Wmissing-prototypes -Wpointer-arith -Wshadow -Winit-self -Wstrict-overflow -Wno-strict-prototypes -fPIE -fPIC -fstack-protector-all -O1 -march=native -mtune=native -O2 -pipe -pie -Wl,-z -Wl,relro -Wl,-z -Wl,now -Wl,-O1 -Wl,--hash-style=gnu -o test-log t-log.o run-t-log.o version.o -pthread -Wl,--gc-sections  -Wl,--as-needed ../libsntp.a ../libopts/.libs/libopts.a -levent_pthreads -levent_core ../../libntp/libntp.a -lcap -lssl -lcrypto -ldl ../unity/libunity.a -lm -pthread
/usr/lib/gcc/x86_64-pc-linux-gnu/10.1.0/../../../../x86_64-pc-linux-gnu/bin/ld: run-t-log.o:(.bss.progname+0x0): multiple definition of `progname'; t-log.o:(.bss.progname+0x0): first defined here
collect2: error: ld returned 1 exit status
make[6]: *** [Makefile:951: test-log] Error 1
make[6]: Leaving directory '/var/tmp/portage/net-misc/ntp-4.2.8_p15/work/ntp-4.2.8p15/sntp/tests'
make[5]: *** [Makefile:1392: check-am] Error 2
make[5]: Leaving directory '/var/tmp/portage/net-misc/ntp-4.2.8_p15/work/ntp-4.2.8p15/sntp/tests'
make[4]: *** [Makefile:1396: check] Error 2
make[4]: Leaving directory '/var/tmp/portage/net-misc/ntp-4.2.8_p15/work/ntp-4.2.8p15/sntp/tests'
make[3]: *** [Makefile:1062: check-recursive] Error 1
make[3]: Leaving directory '/var/tmp/portage/net-misc/ntp-4.2.8_p15/work/ntp-4.2.8p15/sntp'
make[2]: *** [Makefile:1360: check] Error 2
make[2]: Leaving directory '/var/tmp/portage/net-misc/ntp-4.2.8_p15/work/ntp-4.2.8p15/sntp'
make[1]: *** [Makefile:666: check-recursive] Error 1
make[1]: Leaving directory '/var/tmp/portage/net-misc/ntp-4.2.8_p15/work/ntp-4.2.8p15'
make: *** [Makefile:967: check] Error 2
 * ERROR: net-misc/ntp-4.2.8_p15::gentoo failed (test phase):
 *   Make check failed. See above for details.
 * 
 * Call stack:
 *            ebuild.sh, line  125:  Called src_test
 *          environment, line 2009:  Called default
 *   phase-functions.sh, line  855:  Called default_src_test
 *   phase-functions.sh, line  884:  Called __eapi0_src_test
 *     phase-helpers.sh, line  779:  Called die
 * The specific snippet of code:
 *   		$emake_cmd ${internal_opts} check || \
 *   			die "Make check failed. See above for details."

Reproducible: Always
Comment 1 tka 2020-06-27 15:09:09 UTC
Created attachment 646834 [details]
build.log

# emerge -pqv '=net-misc/ntp-4.2.8_p15::gentoo'
[ebuild     U ] net-misc/ntp-4.2.8_p15 [4.2.8_p14-r2] USE="caps ipv6 readline ssl threads -debug -libressl -openntpd -parse-clocks -samba (-selinux) -snmp -vim-syntax -zeroconf" 

# emerge --info '=net-misc/ntp-4.2.8_p15::gentoo'
Portage 2.3.103 (python 3.7.7-final-0, default/linux/amd64/17.1/no-multilib/hardened, gcc-10.1.0, glibc-2.31-r5, 5.7.6 x86_64)
=================================================================
                         System Settings
=================================================================
System uname: Linux-5.7.6-x86_64-Intel-R-_Core-TM-_i7-4810MQ_CPU_@_2.80GHz-with-gentoo-2.7
KiB Mem:    16356856 total,   6275664 free
KiB Swap:   20971516 total,  20971516 free
Timestamp of repository gentoo: Sat, 27 Jun 2020 13:30:01 +0000
Head commit of repository gentoo: d60d8b4ff2362c2e130e1096bd769fefaa1a7d32
sh bash 5.0_p17
ld GNU ld (Gentoo 2.34 p4) 2.34.0
app-shells/bash:          5.0_p17::gentoo
dev-java/java-config:     2.3.1::gentoo
dev-lang/perl:            5.30.3-r1::gentoo
dev-lang/python:          2.7.18::gentoo, 3.7.7-r2::gentoo, 3.8.3::gentoo, 3.9.0_beta3::gentoo
dev-util/cmake:           3.17.3::gentoo
dev-util/pkgconfig:       0.29.2::gentoo
sys-apps/baselayout:      2.7::gentoo
sys-apps/openrc:          0.42.1::gentoo
sys-apps/sandbox:         2.20::gentoo
sys-devel/autoconf:       2.13-r1::gentoo, 2.69-r5::gentoo
sys-devel/automake:       1.16.2::gentoo
sys-devel/binutils:       2.34-r1::gentoo
sys-devel/gcc:            10.1.0-r1::gentoo
sys-devel/gcc-config:     2.3.1::gentoo
sys-devel/libtool:        2.4.6-r6::gentoo
sys-devel/make:           4.3::gentoo
sys-kernel/linux-headers: 5.7::gentoo (virtual/os-headers)
sys-libs/glibc:           2.31-r5::gentoo
Repositories:

gentoo
    location: /usr/portage
    sync-type: rsync
    sync-uri: rsync://rsync.gentoo.org/gentoo-portage
    priority: -1000
    sync-rsync-verify-max-age: 24
    sync-rsync-extra-opts: --new-compress
    sync-rsync-verify-jobs: 1
    sync-rsync-verify-metamanifest: yes

local
    location: /var/lib/portage-local/local
    masters: gentoo
    priority: 0

testing
    location: /var/lib/portage-local/testing
    masters: gentoo
    priority: 1

ACCEPT_KEYWORDS="amd64 ~amd64"
ACCEPT_LICENSE="@FREE"
CBUILD="x86_64-pc-linux-gnu"
CFLAGS="-march=native -mtune=native -O2 -pipe"
CHOST="x86_64-pc-linux-gnu"
CONFIG_PROTECT="/etc /usr/share/gnupg/qualified.txt"
CONFIG_PROTECT_MASK="/etc/ca-certificates.conf /etc/dconf /etc/env.d /etc/fonts/fonts.conf /etc/gconf /etc/gentoo-release /etc/revdep-rebuild /etc/sandbox.d /etc/terminfo /etc/texmf/language.dat.d /etc/texmf/language.def.d /etc/texmf/updmap.d /etc/texmf/web2c"
CXXFLAGS="-march=native -mtune=native -O2 -pipe"
DISTDIR="/usr/portage/distfiles"
EMERGE_DEFAULT_OPTS="--with-bdeps=y"
ENV_UNSET="DBUS_SESSION_BUS_ADDRESS DISPLAY GOBIN GOPATH PERL5LIB PERL5OPT PERLPREFIX PERL_CORE PERL_MB_OPT PERL_MM_OPT XAUTHORITY XDG_CACHE_HOME XDG_CONFIG_HOME XDG_DATA_HOME XDG_RUNTIME_DIR"
FCFLAGS="-O2 -pipe"
FEATURES="assume-digests binpkg-docompress binpkg-dostrip binpkg-logs cgroup collision-protect config-protect-if-modified distlocks ebuild-locks fixlafiles ipc-sandbox merge-sync multilib-strict network-sandbox news parallel-fetch pid-sandbox preserve-libs protect-owned qa-unresolved-soname-deps sandbox sfperms strict test unknown-features-warn unmerge-logs unmerge-orphans userfetch userpriv usersandbox usersync xattr"
FFLAGS="-O2 -pipe"
GENTOO_MIRRORS="http://distfiles.gentoo.org"
LDFLAGS="-Wl,-O1 -Wl,--as-needed -Wl,--hash-style=gnu"
LINGUAS=""
MAKEOPTS="-j8"
PKGDIR="/var/cache/binpkgs"
PORTAGE_CONFIGROOT="/"
PORTAGE_RSYNC_EXTRA_OPTS="--new-compress"
PORTAGE_RSYNC_OPTS="--recursive --links --safe-links --perms --times --omit-dir-times --compress --force --whole-file --delete --stats --human-readable --timeout=180 --exclude=/distfiles --exclude=/local --exclude=/packages --exclude=/.git"
PORTAGE_TMPDIR="/var/tmp"
USE="X a52 acl acpi alsa amd64 avx bzip2 cairo caps cdda cddb cdparanoia crypt cups dbus dri dts dvd elogind fam ffmpeg fftw flac fontconfig gif gimp gmp gnutls gtk hardened iconv icu idn ipv6 jpeg lame lcms libnotify libtirpc lzma mad matroska mmap mmx mmxext mp3 mpeg ncurses networkmanager nptl ogg opengl openmp pam pcre pie png policykit ppds readline sasl sdl seccomp split-usr sse sse2 sse3 sse4 sse4_1 sse4_2 ssl ssp ssse3 startup-notification svg test theora threads tiff truetype udev udisks unicode upower vaapi vorbis wayland x264 xattr xcb xinerama xml xtpax xv xvid zlib" ABI_X86="64" ADA_TARGET="gnat_2018" ALSA_CARDS="ali5451 als4000 atiixp atiixp-modem bt87x ca0106 cmipci emu10k1x ens1370 ens1371 es1938 es1968 fm801 hda-intel intel8x0 intel8x0m maestro3 trident usb-audio via82xx via82xx-modem ymfpci" APACHE2_MODULES="authn_core authz_core socache_shmcb unixd actions alias auth_basic authn_alias authn_anon authn_dbm authn_default authn_file authz_dbm authz_default authz_groupfile authz_host authz_owner authz_user autoindex cache cgi cgid dav dav_fs dav_lock deflate dir disk_cache env expires ext_filter file_cache filter headers include info log_config logio mem_cache mime mime_magic negotiation rewrite setenvif speling status unique_id userdir usertrack vhost_alias" CALLIGRA_FEATURES="karbon sheets words" COLLECTD_PLUGINS="df interface irq load memory rrdtool swap syslog" CPU_FLAGS_X86="aes avx avx2 f16c fma3 mmx mmxext pclmul popcnt sse sse2 sse3 sse4_1 sse4_2 ssse3" ELIBC="glibc" GPSD_PROTOCOLS="ashtech aivdm earthmate evermore fv18 garmin garmintxt gpsclock greis isync itrax mtk3301 nmea ntrip navcom oceanserver oldstyle oncore rtcm104v2 rtcm104v3 sirf skytraq superstar2 timing tsip tripmate tnt ublox ubx" GRUB_PLATFORMS="efi-64" INPUT_DEVICES="evdev synaptics" KERNEL="linux" LCD_DEVICES="bayrad cfontz cfontz633 glk hd44780 lb216 lcdm001 mtxorb ncurses text" LIBREOFFICE_EXTENSIONS="presenter-console presenter-minimizer" OFFICE_IMPLEMENTATION="libreoffice" PHP_TARGETS="php7-2" POSTGRES_TARGETS="postgres10 postgres11" PYTHON_SINGLE_TARGET="python3_7" PYTHON_TARGETS="python2_7 python3_7" RUBY_TARGETS="ruby25" USERLAND="GNU" VIDEO_CARDS="i965 intel nouveau" XTABLES_ADDONS="quota2 psd pknock lscan length2 ipv4options ipset ipp2p iface geoip fuzzy condition tee tarpit sysrq steal rawnat logmark ipmark dhcpmac delude chaos account"
Unset:  CC, CPPFLAGS, CTARGET, CXX, INSTALL_MASK, LANG, LC_ALL, PORTAGE_BINHOST, PORTAGE_BUNZIP2_COMMAND, PORTAGE_COMPRESS, PORTAGE_COMPRESS_FLAGS