Gentoo Websites Logo
Go to: Gentoo Home Documentation Forums Lists Bugs Planet Store Wiki Get Gentoo!
Bug 729340 - dev-lang/elixir-1.10.3 : [TEST] make: *** [Makefile:<snip>: test_stdlib] Error 1
Summary: dev-lang/elixir-1.10.3 : [TEST] make: *** [Makefile:<snip>: test_stdlib] Error 1
Status: CONFIRMED
Alias: None
Product: Gentoo Linux
Classification: Unclassified
Component: Current packages (show other bugs)
Hardware: All Linux
: Normal normal (vote)
Assignee: Mikhail S. Pobolovets
URL:
Whiteboard:
Keywords: TESTFAILURE
Depends on:
Blocks:
 
Reported: 2020-06-23 18:33 UTC by Toralf Förster
Modified: 2021-07-23 07:55 UTC (History)
1 user (show)

See Also:
Package list:
Runtime testing required: ---


Attachments
emerge-info.txt (emerge-info.txt,14.83 KB, text/plain)
2020-06-23 18:33 UTC, Toralf Förster
Details
dev-lang:elixir-1.10.3:20200623-045317.log (dev-lang:elixir-1.10.3:20200623-045317.log,59.44 KB, text/plain)
2020-06-23 18:33 UTC, Toralf Förster
Details
emerge-history.txt (emerge-history.txt,43.27 KB, text/plain)
2020-06-23 18:33 UTC, Toralf Förster
Details
environment (environment,19.17 KB, text/plain)
2020-06-23 18:33 UTC, Toralf Förster
Details
etc.portage.tbz2 (etc.portage.tbz2,13.71 KB, application/x-bzip)
2020-06-23 18:34 UTC, Toralf Förster
Details
temp.tbz2 (temp.tbz2,8.78 KB, application/x-bzip)
2020-06-23 18:34 UTC, Toralf Förster
Details

Note You need to log in before you can comment on or make changes to this bug.
Description Toralf Förster gentoo-dev 2020-06-23 18:33:46 UTC
Randomized with seed 498003
make: *** [Makefile:284: test_stdlib] Error 1
 * ERROR: dev-lang/elixir-1.10.3::gentoo failed (test phase):
 *   Make test failed. See above for details.
 * 

  -------------------------------------------------------------------

  This is an unstable amd64 chroot image at a tinderbox (==build bot)
  name: 17.1_systemd-test-20200620-211522

  -------------------------------------------------------------------

gcc-config -l:
 [1] x86_64-pc-linux-gnu-10.1.0 *
clang version 10.0.0 
Target: x86_64-pc-linux-gnu
Thread model: posix
InstalledDir: /usr/lib/llvm/10/bin
/usr/lib/llvm/10
10.0.0
Available Python interpreters, in order of preference:
  [1]   python3.7
  [2]   python3.9 (fallback)
  [3]   python3.8 (fallback)
  [4]   python2.7 (fallback)
The Glorious Glasgow Haskell Compilation System, version 8.0.2

  timestamp(s) of HEAD at this tinderbox image:
/var/db/repos/gentoo	Tue 23 Jun 2020 03:05:22 AM UTC

emerge -qpvO dev-lang/elixir
[ebuild  N    ] dev-lang/elixir-1.10.3  USE="test"
Comment 1 Toralf Förster gentoo-dev 2020-06-23 18:33:51 UTC
Created attachment 645898 [details]
emerge-info.txt
Comment 2 Toralf Förster gentoo-dev 2020-06-23 18:33:54 UTC
Created attachment 645900 [details]
dev-lang:elixir-1.10.3:20200623-045317.log
Comment 3 Toralf Förster gentoo-dev 2020-06-23 18:33:56 UTC
Created attachment 645902 [details]
emerge-history.txt
Comment 4 Toralf Förster gentoo-dev 2020-06-23 18:33:59 UTC
Created attachment 645904 [details]
environment
Comment 5 Toralf Förster gentoo-dev 2020-06-23 18:34:02 UTC
Created attachment 645906 [details]
etc.portage.tbz2
Comment 6 Toralf Förster gentoo-dev 2020-06-23 18:34:06 UTC
Created attachment 645908 [details]
temp.tbz2
Comment 7 Sergei Trofimovich (RETIRED) gentoo-dev 2020-06-23 20:42:30 UTC
Yeah, looks similar to bug #727344
Comment 8 Toralf Förster gentoo-dev 2020-06-24 08:48:13 UTC
(In reply to Sergei Trofimovich from comment #7)
> Yeah, looks similar to bug #727344

But you fixed that at 2020-06-18 , so this is new, or?
Comment 9 Sergei Trofimovich (RETIRED) gentoo-dev 2020-06-24 08:57:56 UTC
(In reply to Toralf Förster from comment #8)
> (In reply to Sergei Trofimovich from comment #7)
> > Yeah, looks similar to bug #727344
> 
> But you fixed that at 2020-06-18 , so this is new, or?

I think that fix was ineffective and this needs more debugging/fixing.