Gentoo Websites Logo
Go to: Gentoo Home Documentation Forums Lists Bugs Planet Store Wiki Get Gentoo!
Bug 725738 - sys-devel/binutils-hppa64-2.34-r1 fails tests
Summary: sys-devel/binutils-hppa64-2.34-r1 fails tests
Status: CONFIRMED
Alias: None
Product: Gentoo Linux
Classification: Unclassified
Component: Current packages (show other bugs)
Hardware: All Linux
: Normal normal (vote)
Assignee: HPPA Porters
URL:
Whiteboard:
Keywords: TESTFAILURE
Depends on:
Blocks:
 
Reported: 2020-05-28 07:15 UTC by Agostino Sarubbo
Modified: 2020-05-28 22:23 UTC (History)
1 user (show)

See Also:
Package list:
Runtime testing required: ---


Attachments
build.log (build.log,514.92 KB, text/plain)
2020-05-28 07:15 UTC, Agostino Sarubbo
Details

Note You need to log in before you can comment on or make changes to this bug.
Description Agostino Sarubbo gentoo-dev 2020-05-28 07:15:49 UTC
This is an auto-filed bug because sys-devel/binutils-hppa64 fails to compile.
The issue was originally discovered on amd64, but it may be reproducible on other arches as well.
If you think that a different summary clarifies the issue better, feel free to change it.
Attached build log and emerge --info.

NOTE:
If you need further logs, feel free to ask.
Comment 1 Agostino Sarubbo gentoo-dev 2020-05-28 07:15:55 UTC
Created attachment 642178 [details]
build.log

build log and emerge --info
Comment 2 Sergei Trofimovich gentoo-dev 2020-05-28 22:23:54 UTC
These are test failures, not build failures.

"""
		=== ld Summary ===

# of expected passes		463
# of unexpected failures	19
# of expected failures		30
# of untested testcases		16
# of unsupported tests		49
./ld-new 2.34.0

make[5]: *** [Makefile:2560: check-DEJAGNU] Error 1
make[5]: Leaving directory '/var/tmp/portage/sys-devel/binutils-hppa64-2.34-r1/work/build/ld'
make[4]: *** [Makefile:1902: check-am] Error 2
make[4]: Leaving directory '/var/tmp/portage/sys-devel/binutils-hppa64-2.34-r1/work/build/ld'
make[3]: *** [Makefile:1771: check-recursive] Error 1
make[3]: Leaving directory '/var/tmp/portage/sys-devel/binutils-hppa64-2.34-r1/work/build/ld'
make[2]: *** [Makefile:1904: check] Error 2
make[2]: Leaving directory '/var/tmp/portage/sys-devel/binutils-hppa64-2.34-r1/work/build/ld'
make[1]: *** [Makefile:7248: check-ld] Error 2
make[1]: Target 'check-host' not remade because of errors.
make[1]: Leaving directory '/var/tmp/portage/sys-devel/binutils-hppa64-2.34-r1/work/build'
make: *** [Makefile:2221: do-check] Error 2
make: Target 'check' not remade because of errors.
 * ERROR: sys-devel/binutils-hppa64-2.34-r1::gentoo failed (test phase):
 *   emake failed
"""