Gentoo Websites Logo
Go to: Gentoo Home Documentation Forums Lists Bugs Planet Store Wiki Get Gentoo!
Bug 719026 - dev-lang/python-3.8.2-r1 fails test_ctypes test
Summary: dev-lang/python-3.8.2-r1 fails test_ctypes test
Status: UNCONFIRMED
Alias: None
Product: Gentoo Linux
Classification: Unclassified
Component: Current packages (show other bugs)
Hardware: All Linux
: Normal normal (vote)
Assignee: Python Gentoo Team
URL:
Whiteboard:
Keywords: TESTFAILURE
Depends on:
Blocks:
 
Reported: 2020-04-23 10:20 UTC by Paolo Pedroni
Modified: 2020-04-23 20:22 UTC (History)
1 user (show)

See Also:
Package list:
Runtime testing required: ---


Attachments
python-3.8.2-r1:20200423-100106.log.gz (python-3.8.2-r1:20200423-100106.log.gz,49.25 KB, application/gzip)
2020-04-23 10:20 UTC, Paolo Pedroni
Details

Note You need to log in before you can comment on or make changes to this bug.
Description Paolo Pedroni 2020-04-23 10:20:29 UTC
Created attachment 634172 [details]
python-3.8.2-r1:20200423-100106.log.gz

0:01:35 load avg: 4.32 [243/422/1] test_ctypes failed -- running: test_multiprocessing_spawn (1 min 34 sec), test_multiprocessing_forkserver (31.1 sec)
test test_ctypes failed -- Traceback (most recent call last):
  File "/var/tmp/portage/dev-lang/python-3.8.2-r1/work/Python-3.8.2/Lib/ctypes/test/test_find.py", line 112, in test_find_on_libpath
    self.assertEqual(find_library(libname), 'lib%s.so' % libname)
AssertionError: None != 'libpy_ctypes_test_dummy.so'
[...]
== Tests result: FAILURE ==

401 tests OK.

1 test failed:
    test_ctypes

20 tests skipped:
    test_curses test_devpoll test_kqueue test_msilib test_nis
    test_ossaudiodev test_smtpnet test_socketserver test_startfile
    test_timeout test_tix test_tk test_ttk_guionly test_urllib2net
    test_urllibnet test_winconsoleio test_winreg test_winsound
    test_xmlrpc_net test_zipfile64
0:05:25 load avg: 1.07
0:05:25 load avg: 1.07 Re-running failed tests in verbose mode
0:05:25 load avg: 1.07 Re-running test_ctypes in verbose mode
[...]

======================================================================
FAIL: test_find_on_libpath (ctypes.test.test_find.LibPathFindTest)
----------------------------------------------------------------------
Traceback (most recent call last):
  File "/var/tmp/portage/dev-lang/python-3.8.2-r1/work/Python-3.8.2/Lib/ctypes/test/test_find.py", line 112, in test_find_on_libpath
    self.assertEqual(find_library(libname), 'lib%s.so' % libname)
AssertionError: None != 'libpy_ctypes_test_dummy.so'

----------------------------------------------------------------------

Ran 487 tests in 1.334s

FAILED (failures=1, skipped=88)
test test_ctypes failed
1 test failed again:
    test_ctypes

== Tests result: FAILURE then FAILURE ==

401 tests OK.

1 test failed:
    test_ctypes

20 tests skipped:
    test_curses test_devpoll test_kqueue test_msilib test_nis
    test_ossaudiodev test_smtpnet test_socketserver test_startfile
    test_timeout test_tix test_tk test_ttk_guionly test_urllib2net
    test_urllibnet test_winconsoleio test_winreg test_winsound
    test_xmlrpc_net test_zipfile64

1 re-run test:
    test_ctypes

Total duration: 5 min 26 sec
Tests result: FAILURE then FAILURE
make: *** [Makefile:1129: test] Error 2
 * ERROR: dev-lang/python-3.8.2-r1::gentoo failed (test phase):
 *   emake failed

# emerge --info =dev-lang/python-3.8.2-r1
Portage 2.3.89 (python 3.7.7-final-0, default/linux/amd64/17.1/desktop, gcc-9.3.0, glibc-2.29-r7, 5.4.28-gentoo x86_64)
=================================================================
                         System Settings
=================================================================
System uname: Linux-5.4.28-gentoo-x86_64-AMD_Phenom-tm-_II_X4_965_Processor-with-gentoo-2.6
KiB Mem:    12257860 total,   3902560 free
KiB Swap:    8351740 total,   8326960 free
Timestamp of repository gentoo: Thu, 23 Apr 2020 04:45:01 +0000
Head commit of repository gentoo: 29ec83a8769c3f41d1e601609deacf2884b7ad8d
sh dash 0.5.9.1-r3
ld GNU gold (Gentoo 2.33.1 p2 2.33.1) 1.16
distcc 3.3.3 x86_64-pc-linux-gnu [enabled]
ccache version 3.7.7 [disabled]
app-shells/bash:          4.4_p23-r1::gentoo
dev-java/java-config:     2.2.0-r4::gentoo
dev-lang/perl:            5.30.1::gentoo
dev-lang/python:          2.7.17-r2::gentoo, 3.7.7-r1::gentoo
dev-util/ccache:          3.7.7-r1::gentoo
dev-util/cmake:           3.16.5::gentoo
sys-apps/baselayout:      2.6-r1::gentoo
sys-apps/sandbox:         2.13::gentoo
sys-devel/autoconf:       2.13-r1::gentoo, 2.69-r4::gentoo
sys-devel/automake:       1.16.1-r1::gentoo
sys-devel/binutils:       2.33.1-r1::gentoo
sys-devel/gcc:            9.3.0::gentoo
sys-devel/gcc-config:     2.2.1::gentoo
sys-devel/libtool:        2.4.6-r6::gentoo
sys-devel/make:           4.2.1-r4::gentoo
sys-kernel/linux-headers: 5.4::gentoo (virtual/os-headers)
sys-libs/glibc:           2.29-r7::gentoo
Repositories:

gentoo
    location: /usr/portage
    sync-type: rsync
    sync-uri: rsync://rsync.europe.gentoo.org/gentoo-portage
    priority: -1000
    sync-rsync-verify-jobs: 1
    sync-rsync-verify-max-age: 24
    sync-rsync-extra-opts: 
    sync-rsync-verify-metamanifest: yes

x-portage
    location: /usr/local/portage
    masters: gentoo
    priority: 0

ACCEPT_KEYWORDS="amd64"
ACCEPT_LICENSE="* -@EULA"
CBUILD="x86_64-pc-linux-gnu"
CFLAGS="-O2 -pipe -frecord-gcc-switches -march=amdfam10 -flto=5"
CHOST="x86_64-pc-linux-gnu"
CONFIG_PROTECT="/etc /usr/lib64/libreoffice/program/sofficerc /usr/share/config /usr/share/gnupg/qualified.txt"
CONFIG_PROTECT_MASK="/etc/ca-certificates.conf /etc/dconf /etc/env.d /etc/fonts/fonts.conf /etc/gconf /etc/gentoo-release /etc/revdep-rebuild /etc/sandbox.d /etc/terminfo"
CXXFLAGS="-O2 -pipe -frecord-gcc-switches -march=amdfam10 -flto=5"
DISTDIR="/usr/portage/distfiles"
EMERGE_DEFAULT_OPTS="--keep-going y --with-bdeps y"
ENV_UNSET="DBUS_SESSION_BUS_ADDRESS DISPLAY GOBIN PERL5LIB PERL5OPT PERLPREFIX PERL_CORE PERL_MB_OPT PERL_MM_OPT XAUTHORITY XDG_CACHE_HOME XDG_CONFIG_HOME XDG_DATA_HOME XDG_RUNTIME_DIR"
FCFLAGS="-O2 -pipe -frecord-gcc-switches -march=amdfam10 -flto=5"
FEATURES="assume-digests binpkg-docompress binpkg-dostrip binpkg-logs cgroup compress-build-logs config-protect-if-modified distcc distlocks ebuild-locks ipc-sandbox merge-sync multilib-strict network-sandbox news parallel-fetch pid-sandbox preserve-libs protect-owned qa-unresolved-soname-deps sandbox sfperms split-elog split-log strict test unknown-features-warn unmerge-logs unmerge-orphans userfetch userpriv usersandbox usersync xattr"
FFLAGS="-O2 -pipe -frecord-gcc-switches -march=amdfam10 -flto=5"
GENTOO_MIRRORS="http://mirrors.evowise.com/gentoo/ http://gentoo.modulix.net/gentoo/ https://mirrors.evowise.com/gentoo/ http://mirror.eu.oneandone.net/linux/distributions/gentoo/gentoo/ http://mirror.netcologne.de/gentoo/"
LANG="it_IT.UTF-8"
LDFLAGS="-Wl,-O1 -Wl,--as-needed -Wl,--hash-style=gnu -Wl,--sort-common -flto=5"
LINGUAS="it it_IT"
MAKEOPTS="-j12 -l4"
PKGDIR="/usr/portage/packages"
PORTAGE_CONFIGROOT="/"
PORTAGE_RSYNC_OPTS="--recursive --links --safe-links --perms --times --omit-dir-times --compress --force --whole-file --delete --stats --human-readable --timeout=180 --exclude=/distfiles --exclude=/local --exclude=/packages --exclude=/.git"
PORTAGE_TMPDIR="/var/tmp"
USE="3dnow X a52 aac aalib acl acpi alsa amd64 ao audiofile bash-completion bluetooth branding brotli bzip2 cairo caps cdda cddb cdparanoia cdr cli crypt css cups curl dbus dga djvu dri dts dvd dvdr emboss encode exif expat fbcon ffmpeg fftw flac fontconfig fortran ftp gd gdbm gif gmp gnutls gpm graphviz gtk iconv icu idn ieee1394 imagemagick imlib inotify introspection ipv6 java jbig jemalloc jpeg jpeg2k kde lame lcms libass libnotify libsamplerate libtirpc lm_sensors lua lzma lzo mad mmap mng mp3 mp4 mpeg mplayer multilib musicbrainz ncurses nls nptl nsplugin offensive ogg openal opengl openmp pam pango pcre pdf png policykit postscript ppds pulseaudio qt5 rdesktop readline samba sctp sdl seccomp sndfile speex spell split-usr sqlite ssl startup-notification svg symlink syslog systemd taglib test theora threads tiff truetype udev udisks unicode upower usb vaapi vala vdpau vim-syntax vorbis wavpack wayland win32codecs wmf wxwidgets x264 xattr xcb xcomposite xine xinerama xml xpm xscreensaver xv xvid zlib zstd" ABI_X86="64" ADA_TARGET="gnat_2018" ALSA_CARDS="hda-intel virmidi" APACHE2_MODULES="authn_core authz_core socache_shmcb unixd actions alias auth_basic authn_alias authn_anon authn_dbm authn_default authn_file authz_dbm authz_default authz_groupfile authz_host authz_owner authz_user autoindex cache cgi cgid dav dav_fs dav_lock deflate dir disk_cache env expires ext_filter file_cache filter headers include info log_config logio mem_cache mime mime_magic negotiation rewrite setenvif speling status unique_id userdir usertrack vhost_alias" CALLIGRA_FEATURES="karbon sheets words" CAMERAS="kodak ptp2" COLLECTD_PLUGINS="df interface irq load memory rrdtool swap syslog" CPU_FLAGS_X86="3dnow 3dnowext mmx mmxext popcnt sse sse2 sse3 sse4a" CURL_SSL="gnutls" ELIBC="glibc" GPSD_PROTOCOLS="ashtech aivdm earthmate evermore fv18 garmin garmintxt gpsclock greis isync itrax mtk3301 nmea ntrip navcom oceanserver oldstyle oncore rtcm104v2 rtcm104v3 sirf skytraq superstar2 timing tsip tripmate tnt ublox ubx" GRUB_PLATFORMS="pc" INPUT_DEVICES="libinput" KERNEL="linux" L10N="it en" LCD_DEVICES="bayrad cfontz cfontz633 glk hd44780 lb216 lcdm001 mtxorb ncurses text" OFFICE_IMPLEMENTATION="libreoffice" PHP_TARGETS="php7-2" POSTGRES_TARGETS="postgres10 postgres11" PYTHON_SINGLE_TARGET="python3_7" PYTHON_TARGETS="python3_7" RUBY_TARGETS="ruby24 ruby25" USERLAND="GNU" VIDEO_CARDS="radeon r600" XTABLES_ADDONS="quota2 psd pknock lscan length2 ipv4options ipset ipp2p iface geoip fuzzy condition tee tarpit sysrq steal rawnat logmark ipmark dhcpmac delude chaos account"
Unset:  CC, CPPFLAGS, CTARGET, CXX, INSTALL_MASK, LC_ALL, PORTAGE_BINHOST, PORTAGE_BUNZIP2_COMMAND, PORTAGE_COMPRESS, PORTAGE_COMPRESS_FLAGS, PORTAGE_RSYNC_EXTRA_OPTS

# emerge -1pqv =dev-lang/python-3.8.2-r1
[ebuild  NS   ] dev-lang/python-3.8.2-r1 [2.7.17-r2, 3.7.7-r1] USE="bluetooth gdbm ipv6 ncurses readline sqlite ssl test* tk xml -build -examples -hardened -libressl -wininst"
Comment 1 Paolo Pedroni 2020-04-23 10:21:06 UTC
The same happens with -r2...