Gentoo Websites Logo
Go to: Gentoo Home Documentation Forums Lists Bugs Planet Store Wiki Get Gentoo!
Bug 716282 - app-admin/paxtest-0.9.15-r1 : chpax-0.7/chpax.h: fatal error: a.out.h: No such file or directory
Summary: app-admin/paxtest-0.9.15-r1 : chpax-0.7/chpax.h: fatal error: a.out.h: No suc...
Status: CONFIRMED
Alias: None
Product: Gentoo Linux
Classification: Unclassified
Component: Current packages (show other bugs)
Hardware: All Linux
: Normal normal (vote)
Assignee: Gentoo musl team
URL:
Whiteboard:
Keywords:
Depends on:
Blocks: missing-musl-includes
  Show dependency tree
 
Reported: 2020-04-05 09:11 UTC by Toralf Förster
Modified: 2020-04-05 09:11 UTC (History)
2 users (show)

See Also:
Package list:
Runtime testing required: ---


Attachments
emerge-info.txt (emerge-info.txt,16.58 KB, text/plain)
2020-04-05 09:11 UTC, Toralf Förster
Details
app-admin:paxtest-0.9.15-r1:20200405-051337.log (app-admin:paxtest-0.9.15-r1:20200405-051337.log,2.03 KB, text/plain)
2020-04-05 09:11 UTC, Toralf Förster
Details
emerge-history.txt (emerge-history.txt,331.17 KB, text/plain)
2020-04-05 09:11 UTC, Toralf Förster
Details
environment (environment,47.29 KB, text/plain)
2020-04-05 09:11 UTC, Toralf Förster
Details
etc.portage.tbz2 (etc.portage.tbz2,25.73 KB, application/x-bzip)
2020-04-05 09:11 UTC, Toralf Förster
Details
temp.tbz2 (temp.tbz2,12.57 KB, application/x-bzip)
2020-04-05 09:11 UTC, Toralf Förster
Details

Note You need to log in before you can comment on or make changes to this bug.
Description Toralf Förster gentoo-dev 2020-04-05 09:11:01 UTC
x86_64-gentoo-linux-musl-gcc -O2 -pipe -march=native  -U_FORTIFY_SOURCE -DRUNDIR=\/usr/lib/paxtest\ -fno-stack-protector -ftrampolines -o chpax-0.7/aout.o -c chpax-0.7/aout.c
In file included from chpax-0.7/aout.c:7:
chpax-0.7/chpax.h:15:10: fatal error: a.out.h: No such file or directory
   15 | #include <a.out.h>
      |          ^~~~~~~~~
compilation terminated.

  -------------------------------------------------------------------

  This is an unstable amd64 chroot image at a tinderbox (==build bot)
  name: 17.0_musl-20200328-141627

  -------------------------------------------------------------------

  Please see the tracker bug for details.

gcc-config -l:
 [1] x86_64-gentoo-linux-musl-9.3.0 *
clang version 10.0.0 
Target: x86_64-gentoo-linux-musl
Thread model: posix
InstalledDir: /usr/lib/llvm/10/bin
/usr/lib/llvm/10
10.0.0
Available Python interpreters, in order of preference:
  [1]   python3.8
  [2]   python3.7
  [3]   python3.6
  [4]   python2.7 (fallback)
Available Ruby profiles:
  [1]   ruby24 (with Rubygems)
  [2]   ruby25 (with Rubygems) *
Available Rust versions:
  [1]   rust-1.42.0 *
The following VMs are available for generation-2:
Available Java Virtual Machines:
  (none found)


timestamp of HEAD at this tinderbox image:
/var/db/repos/gentoo	Sun Apr  5 03:07:54 UTC 2020
/var/db/repos/musl	Sat Apr  4 03:02:24 UTC 2020

emerge -qpvO app-admin/paxtest
[ebuild  N    ] app-admin/paxtest-0.9.15-r1
Comment 1 Toralf Förster gentoo-dev 2020-04-05 09:11:04 UTC
Created attachment 630334 [details]
emerge-info.txt
Comment 2 Toralf Förster gentoo-dev 2020-04-05 09:11:07 UTC
Created attachment 630336 [details]
app-admin:paxtest-0.9.15-r1:20200405-051337.log
Comment 3 Toralf Förster gentoo-dev 2020-04-05 09:11:10 UTC
Created attachment 630338 [details]
emerge-history.txt
Comment 4 Toralf Förster gentoo-dev 2020-04-05 09:11:12 UTC
Created attachment 630340 [details]
environment
Comment 5 Toralf Förster gentoo-dev 2020-04-05 09:11:15 UTC
Created attachment 630342 [details]
etc.portage.tbz2
Comment 6 Toralf Förster gentoo-dev 2020-04-05 09:11:18 UTC
Created attachment 630344 [details]
temp.tbz2