Gentoo Websites Logo
Go to: Gentoo Home Documentation Forums Lists Bugs Planet Store Wiki Get Gentoo!
Bug 713776 - sys-fabric/libcxgb4-1.3.2 : src/queue.h: fatal error: sys/cdefs.h: No such file or directory
Summary: sys-fabric/libcxgb4-1.3.2 : src/queue.h: fatal error: sys/cdefs.h: No such fi...
Status: CONFIRMED
Alias: None
Product: Gentoo Linux
Classification: Unclassified
Component: Current packages (show other bugs)
Hardware: All Linux
: Normal normal (vote)
Assignee: Gentoo musl team
URL:
Whiteboard: cdefs.h
Keywords:
Depends on:
Blocks: missing-musl-includes
  Show dependency tree
 
Reported: 2020-03-21 11:14 UTC by Toralf Förster
Modified: 2020-03-22 17:56 UTC (History)
1 user (show)

See Also:
Package list:
Runtime testing required: ---


Attachments
emerge-info.txt (emerge-info.txt,17.06 KB, text/plain)
2020-03-21 11:14 UTC, Toralf Förster
Details
emerge-history.txt (emerge-history.txt,230.24 KB, text/plain)
2020-03-21 11:14 UTC, Toralf Förster
Details
environment (environment,87.30 KB, text/plain)
2020-03-21 11:15 UTC, Toralf Förster
Details
etc.portage.tbz2 (etc.portage.tbz2,19.20 KB, application/x-bzip)
2020-03-21 11:15 UTC, Toralf Förster
Details
logs.tbz2 (logs.tbz2,6.25 KB, application/x-bzip)
2020-03-21 11:15 UTC, Toralf Förster
Details
sys-fabric:libcxgb4-1.3.2:20200321-100519.log (sys-fabric:libcxgb4-1.3.2:20200321-100519.log,8.36 KB, text/plain)
2020-03-21 11:15 UTC, Toralf Förster
Details
temp.tbz2 (temp.tbz2,22.08 KB, application/x-bzip)
2020-03-21 11:15 UTC, Toralf Förster
Details

Note You need to log in before you can comment on or make changes to this bug.
Description Toralf Förster gentoo-dev 2020-03-21 11:14:52 UTC
In file included from src/libcxgb4.h:44,
                 from src/cq.c:42:
src/queue.h:68:10: fatal error: sys/cdefs.h: No such file or directory
   68 | #include <sys/cdefs.h>
      |          ^~~~~~~~~~~~~
compilation terminated.

  -------------------------------------------------------------------

  This is an unstable amd64 chroot image at a tinderbox (==build bot)
  name: 17.0_musl-20200316-165821

  -------------------------------------------------------------------

gcc-config -l:
 [1] x86_64-gentoo-linux-musl-9.3.0 *
clang version 10.0.0 
Target: x86_64-gentoo-linux-musl
Thread model: posix
InstalledDir: /usr/lib/llvm/10/bin
/usr/lib/llvm/10
10.0.0
Available Python interpreters, in order of preference:
  [1]   python3.8
  [2]   python3.7
  [3]   python3.6
  [4]   python2.7 (fallback)
Available Ruby profiles:
  [1]   ruby24 (with Rubygems)
  [2]   ruby25 (with Rubygems) *
Available Rust versions:
  [1]   rust-1.41.1 *

timestamp of HEAD at this tinderbox image:
/var/db/repos/gentoo	Sat Mar 21 09:38:33 UTC 2020
/var/db/repos/musl	Sat Mar 21 03:09:12 UTC 2020

emerge -qpvO sys-fabric/libcxgb4
[ebuild  N    ] sys-fabric/libcxgb4-1.3.2
Comment 1 Toralf Förster gentoo-dev 2020-03-21 11:14:55 UTC
Created attachment 623772 [details]
emerge-info.txt
Comment 2 Toralf Förster gentoo-dev 2020-03-21 11:14:57 UTC
Created attachment 623774 [details]
emerge-history.txt
Comment 3 Toralf Förster gentoo-dev 2020-03-21 11:15:00 UTC
Created attachment 623776 [details]
environment
Comment 4 Toralf Förster gentoo-dev 2020-03-21 11:15:03 UTC
Created attachment 623778 [details]
etc.portage.tbz2
Comment 5 Toralf Förster gentoo-dev 2020-03-21 11:15:06 UTC
Created attachment 623780 [details]
logs.tbz2
Comment 6 Toralf Förster gentoo-dev 2020-03-21 11:15:08 UTC
Created attachment 623782 [details]
sys-fabric:libcxgb4-1.3.2:20200321-100519.log
Comment 7 Toralf Förster gentoo-dev 2020-03-21 11:15:11 UTC
Created attachment 623784 [details]
temp.tbz2
Comment 8 Michael 'veremitz' Everitt 2020-03-22 17:56:00 UTC
musl upstream has a FAQ entry specifically for this error:
https://wiki.musl-libc.org/faq.html#Q:-When-compiling-something-against-musl,-I-get-error-messages-about-%3Ccode%3Esys/cdefs.h%3C/code%3E

We will need to check/report upstream and patch affected code temporarily.