Gentoo Websites Logo
Go to: Gentoo Home Documentation Forums Lists Bugs Planet Store Wiki Get Gentoo!
Bug 712748 - dev-cpp/kokkos-3.1.01-r1 : /.../Kokkos_Stacktrace.cpp: fatal error: execinfo.h: No such file or directory
Summary: dev-cpp/kokkos-3.1.01-r1 : /.../Kokkos_Stacktrace.cpp: fatal error: execinfo....
Status: CONFIRMED
Alias: None
Product: Gentoo Linux
Classification: Unclassified
Component: Current packages (show other bugs)
Hardware: All Linux
: Normal normal (vote)
Assignee: Gentoo musl team
URL:
Whiteboard:
Keywords:
Depends on:
Blocks: 716422 856418
  Show dependency tree
 
Reported: 2020-03-15 18:49 UTC by Toralf Förster
Modified: 2022-08-07 08:20 UTC (History)
1 user (show)

See Also:
Package list:
Runtime testing required: ---


Attachments
emerge-info.txt (emerge-info.txt,15.65 KB, text/plain)
2020-03-15 18:49 UTC, Toralf Förster
Details
dev-cpp:kokkos-3.0.00:20200315-180924.log (dev-cpp:kokkos-3.0.00:20200315-180924.log,12.85 KB, text/plain)
2020-03-15 18:49 UTC, Toralf Förster
Details
emerge-history.txt (emerge-history.txt,142.39 KB, text/plain)
2020-03-15 18:49 UTC, Toralf Förster
Details
environment (environment,88.37 KB, text/plain)
2020-03-15 18:49 UTC, Toralf Förster
Details
etc.portage.tbz2 (etc.portage.tbz2,17.32 KB, application/x-bzip)
2020-03-15 18:49 UTC, Toralf Förster
Details
logs.tbz2 (logs.tbz2,3.70 KB, application/x-bzip)
2020-03-15 18:49 UTC, Toralf Förster
Details
temp.tbz2 (temp.tbz2,23.00 KB, application/x-bzip)
2020-03-15 18:49 UTC, Toralf Förster
Details

Note You need to log in before you can comment on or make changes to this bug.
Description Toralf Förster gentoo-dev 2020-03-15 18:49:19 UTC
FAILED: core/src/CMakeFiles/kokkoscore.dir/impl/Kokkos_Stacktrace.cpp.o 
/usr/bin/x86_64-gentoo-linux-musl-g++ -Dkokkoscore_EXPORTS -Icore/src -I/var/tmp/portage/dev-cpp/kokkos-3.0.00/work/kokkos-3.0.00/core/src -I.  -DNDEBUG -O2 -pipe -march=native -fno-common -falign-functions=32:25:16 -fPIC   -fopenmp -MD -MT core/src/CMakeFiles/kokkoscore.dir/impl/Kokkos_Stacktrace.cpp.o -MF core/src/CMakeFiles/kokkoscore.dir/impl/Kokkos_Stacktrace.cpp.o.d -o core/src/CMakeFiles/kokkoscore.dir/impl/Kokkos_Stacktrace.cpp.o -c /var/tmp/portage/dev-cpp/kokkos-3.0.00/work/kokkos-3.0.00/core/src/impl/Kokkos_Stacktrace.cpp
/var/tmp/portage/dev-cpp/kokkos-3.0.00/work/kokkos-3.0.00/core/src/impl/Kokkos_Stacktrace.cpp:6:10: fatal error: execinfo.h: No such file or directory
    6 | #include <execinfo.h>
      |          ^~~~~~~~~~~~
compilation terminated.

  -------------------------------------------------------------------

  This is an unstable amd64 chroot image at a tinderbox (==build bot)
  name: 17.0_musl-20200311-204810

  -------------------------------------------------------------------

gcc-config -l:
 [1] x86_64-gentoo-linux-musl-9.2.0 *
 [2] x86_64-gentoo-linux-musl-9.3.0
clang version 10.0.0 
Target: x86_64-gentoo-linux-musl
Thread model: posix
InstalledDir: /usr/lib/llvm/10/bin
/usr/lib/llvm/10
10.0.0
Available Python interpreters, in order of preference:
  [1]   python3.8
  [2]   python3.7
  [3]   python3.6
  [4]   python2.7 (fallback)
Available Ruby profiles:
  [1]   ruby24 (with Rubygems)
  [2]   ruby25 (with Rubygems) *
Available Rust versions:
  [1]   rust-bin-1.41.1
  [2]   rust-1.41.1 *
The following VMs are available for generation-2:

repository:
==> /var/db/repos/gentoo/metadata/timestamp.chk <==
Sun, 15 Mar 2020 17:38:35 +0000
emerge -qpvO dev-cpp/kokkos
[ebuild  N    ] dev-cpp/kokkos-3.0.00  USE="openmp -test"
Comment 1 Toralf Förster gentoo-dev 2020-03-15 18:49:22 UTC
Created attachment 619946 [details]
emerge-info.txt
Comment 2 Toralf Förster gentoo-dev 2020-03-15 18:49:25 UTC
Created attachment 619948 [details]
dev-cpp:kokkos-3.0.00:20200315-180924.log
Comment 3 Toralf Förster gentoo-dev 2020-03-15 18:49:28 UTC
Created attachment 619950 [details]
emerge-history.txt
Comment 4 Toralf Förster gentoo-dev 2020-03-15 18:49:33 UTC
Created attachment 619952 [details]
environment
Comment 5 Toralf Förster gentoo-dev 2020-03-15 18:49:36 UTC
Created attachment 619954 [details]
etc.portage.tbz2
Comment 6 Toralf Förster gentoo-dev 2020-03-15 18:49:39 UTC
Created attachment 619956 [details]
logs.tbz2
Comment 7 Toralf Förster gentoo-dev 2020-03-15 18:49:41 UTC
Created attachment 619958 [details]
temp.tbz2
Comment 8 Christoph Junghans gentoo-dev 2020-03-15 19:56:12 UTC
Reported upstream: https://github.com/kokkos/kokkos/issues/2873
Comment 9 Toralf Förster gentoo-dev 2020-03-16 16:12:25 UTC
The first attempt to tinderbox a musl image failed at all.

I'll mass close therefore all filed bug reports of the last days related to this tinderbox image.

Please feel free to re-open if you think that the bug is real in musl and not fixed by the musl overlay.
Comment 10 Agostino Sarubbo gentoo-dev 2022-08-07 08:20:50 UTC
tinderbox_musl has reproduced this issue with version 3.1.01-r1 - Updating summary.