Gentoo Websites Logo
Go to: Gentoo Home Documentation Forums Lists Bugs Planet Store Wiki Get Gentoo!
Bug 712162 - sys-devel/gdb-9.1 several tests fail.
Summary: sys-devel/gdb-9.1 several tests fail.
Status: CONFIRMED
Alias: None
Product: Gentoo Linux
Classification: Unclassified
Component: Current packages (show other bugs)
Hardware: All Linux
: Normal normal (vote)
Assignee: Gentoo Toolchain Maintainers
URL:
Whiteboard:
Keywords: TESTFAILURE
Depends on:
Blocks:
 
Reported: 2020-03-11 16:41 UTC by Paolo Pedroni
Modified: 2020-03-16 17:49 UTC (History)
1 user (show)

See Also:
Package list:
Runtime testing required: ---


Attachments
gdb-9.1:20200311-152329.log.gz (gdb-9.1:20200311-152329.log.gz,339.75 KB, application/gzip)
2020-03-11 16:41 UTC, Paolo Pedroni
Details
build.log (build.log.xz,116.02 KB, application/x-xz)
2020-03-16 17:49 UTC, Rolf Eike Beer
Details

Note You need to log in before you can comment on or make changes to this bug.
Description Paolo Pedroni 2020-03-11 16:41:07 UTC
Created attachment 617976 [details]
gdb-9.1:20200311-152329.log.gz

=== gdb Summary ===

# of expected passes            72275
# of unexpected failures        871
# of unexpected successes       1
# of expected failures          44
# of unknown successes          5
# of known failures             106
# of untested testcases         81
# of unresolved testcases       6
# of unsupported tests          290
/var/tmp/portage/sys-devel/gdb-9.1/work/gdb-9.1-build/gdb/gdb version  9.1 -nw -nx -data-directory /var/tmp/portage/sys-devel/gdb-9.1/work/gdb-9.1-build/gdb/testsuite/../data-directory 

make[4]: *** [Makefile:230: check-parallel] Error 2
make[4]: Leaving directory '/var/tmp/portage/sys-devel/gdb-9.1/work/gdb-9.1-build/gdb/testsuite'
make[3]: *** [Makefile:159: check] Error 2
make[3]: Leaving directory '/var/tmp/portage/sys-devel/gdb-9.1/work/gdb-9.1-build/gdb/testsuite'
make[2]: *** [Makefile:1679: check] Error 2
make[2]: Leaving directory '/var/tmp/portage/sys-devel/gdb-9.1/work/gdb-9.1-build/gdb'
make[1]: *** [Makefile:8610: check-gdb] Error 2
make[1]: Leaving directory '/var/tmp/portage/sys-devel/gdb-9.1/work/gdb-9.1-build'
make: *** [Makefile:2203: do-check] Error 2
make: Leaving directory '/var/tmp/portage/sys-devel/gdb-9.1/work/gdb-9.1-build'
 * ERROR: sys-devel/gdb-9.1::gentoo failed (test phase):
 *   emake failed

# emerge --info =sys-devel/gdb-9.1
Portage 2.3.89 (python 3.7.6-final-0, default/linux/amd64/17.1/desktop/plasma/systemd, gcc-9.2.0, glibc-2.29-r7, 5.4.24 x86_64)
=================================================================
                         System Settings
=================================================================
System uname: Linux-5.4.24-x86_64-AMD_Phenom-tm-_II_X6_1100T_Processor-with-gentoo-2.6
KiB Mem:    12009972 total,   1795584 free
KiB Swap:   12550140 total,  12400636 free
Timestamp of repository gentoo: Wed, 11 Mar 2020 06:45:01 +0000
Head commit of repository gentoo: 797388f33ffb34b32c2d7e70efd58b00093e4cdc
sh dash 0.5.9.1-r3
ld GNU gold (Gentoo 2.33.1 p2 2.33.1) 1.16
distcc 3.3.3 x86_64-pc-linux-gnu [enabled]
ccache version 3.7.7 [disabled]
app-shells/bash:          4.4_p23-r1::gentoo
dev-java/java-config:     2.2.0-r4::gentoo
dev-lang/perl:            5.30.1::gentoo
dev-lang/python:          2.7.17-r1::gentoo, 3.7.6::gentoo
dev-util/ccache:          3.7.7::gentoo
dev-util/cmake:           3.14.6::gentoo
sys-apps/baselayout:      2.6-r1::gentoo
sys-apps/sandbox:         2.13::gentoo
sys-devel/autoconf:       2.13-r1::gentoo, 2.69-r4::gentoo
sys-devel/automake:       1.16.1-r1::gentoo
sys-devel/binutils:       2.33.1-r1::gentoo
sys-devel/gcc:            9.2.0-r2::gentoo
sys-devel/gcc-config:     2.2.1::gentoo
sys-devel/libtool:        2.4.6-r6::gentoo
sys-devel/make:           4.2.1-r4::gentoo
sys-kernel/linux-headers: 4.19::gentoo (virtual/os-headers)
sys-libs/glibc:           2.29-r7::gentoo
Repositories:

gentoo
    location: /usr/portage
    sync-type: rsync
    sync-uri: rsync://rsync.europe.gentoo.org/gentoo-portage
    priority: -1000
    sync-rsync-verify-jobs: 1
    sync-rsync-extra-opts: 
    sync-rsync-verify-metamanifest: yes
    sync-rsync-verify-max-age: 24

x-portage
    location: /usr/local/portage
    masters: gentoo
    priority: 0

ACCEPT_KEYWORDS="amd64"
ACCEPT_LICENSE="* -@EULA"
CBUILD="x86_64-pc-linux-gnu"
CFLAGS="-O2 -pipe -frecord-gcc-switches -march=amdfam10 -flto=7"
CHOST="x86_64-pc-linux-gnu"
CONFIG_PROTECT="/etc /usr/lib64/libreoffice/program/sofficerc /usr/share/config /usr/share/gnupg/qualified.txt"
CONFIG_PROTECT_MASK="/etc/ca-certificates.conf /etc/dconf /etc/env.d /etc/fonts/fonts.conf /etc/gconf /etc/gentoo-release /etc/revdep-rebuild /etc/sandbox.d /etc/terminfo"
CXXFLAGS="-O2 -pipe -frecord-gcc-switches -march=amdfam10 -flto=7"
DISTDIR="/usr/portage/distfiles"
EMERGE_DEFAULT_OPTS="--keep-going y --with-bdeps y"
ENV_UNSET="DBUS_SESSION_BUS_ADDRESS DISPLAY GOBIN PERL5LIB PERL5OPT PERLPREFIX PERL_CORE PERL_MB_OPT PERL_MM_OPT XAUTHORITY XDG_CACHE_HOME XDG_CONFIG_HOME XDG_DATA_HOME XDG_RUNTIME_DIR"
FCFLAGS="-O2 -pipe -frecord-gcc-switches -march=amdfam10 -flto=7"
FEATURES="assume-digests binpkg-docompress binpkg-dostrip binpkg-logs cgroup compress-build-logs config-protect-if-modified distcc distlocks ebuild-locks ipc-sandbox merge-sync multilib-strict network-sandbox news parallel-fetch pid-sandbox preserve-libs protect-owned qa-unresolved-soname-deps sandbox sfperms split-elog split-log strict test unknown-features-warn unmerge-logs unmerge-orphans userfetch userpriv usersandbox usersync xattr"
FFLAGS="-O2 -pipe -frecord-gcc-switches -march=amdfam10 -flto=7"
GENTOO_MIRRORS="http://mirrors.evowise.com/gentoo/ http://mirror.eu.oneandone.net/linux/distributions/gentoo/gentoo/ http://mirror.netcologne.de/gentoo/ http://ftp.halifax.rwth-aachen.de/gentoo/"
LANG="it_IT.UTF-8"
LDFLAGS="-Wl,-O1 -Wl,--as-needed -Wl,--hash-style=gnu -Wl,--sort-common -flto=7"
LINGUAS="it it_IT"
MAKEOPTS="-j12 -l6"
PKGDIR="/usr/portage/packages"
PORTAGE_CONFIGROOT="/"
PORTAGE_RSYNC_OPTS="--recursive --links --safe-links --perms --times --omit-dir-times --compress --force --whole-file --delete --stats --human-readable --timeout=180 --exclude=/distfiles --exclude=/local --exclude=/packages --exclude=/.git"
PORTAGE_TMPDIR="/var/tmp"
USE="X a52 aac aalib acl acpi activities adns alsa amd64 ao audiofile bash-completion bluetooth branding brotli bzip2 cairo caps cdda cddb cdparanoia cdr cli crypt css cups curl cxx dbus declarative dga djvu dri dts dvd dvdr emboss encode exif expat fbcon ffmpeg fftw flac fontconfig fortran ftp gd gdbm geoip gif gimp gmp gnutls gphoto2 gpm graphviz gtk handbook iconv icu idn imagemagick imlib ipv6 java javascript jbig jemalloc jpeg jpeg2k kde kipi kwallet lame lcms libass libnotify libsamplerate libtirpc lm_sensors lua lzma lzo mad mmap mng mp3 mp4 mpeg mplayer multilib musicbrainz ncurses nls nptl nsplugin offensive ogg openal opengl openmp pam pango pcre pdf phonon plasma png policykit postscript ppds pulseaudio qml qt5 rdesktop readline recode samba scanner sctp sdl seccomp sndfile sockets speex spell split-usr sqlite sqlite3 ssl startup-notification svg symlink syslog systemd sysvipc taglib test theora threads tidy tiff truetype udev udisks unicode upower usb vaapi vala vdpau vim-syntax vnc vorbis wavpack wayland widgets win32codecs wmf wxwidgets x264 xattr xcb xcomposite xine xml xpm xscreensaver xv xvid yahoo zlib zstd" ABI_X86="64" ADA_TARGET="gnat_2018" ALSA_CARDS="hda-intel virmidi" APACHE2_MODULES="authn_core authz_core socache_shmcb unixd actions alias auth_basic authn_alias authn_anon authn_dbm authn_default authn_file authz_dbm authz_default authz_groupfile authz_host authz_owner authz_user autoindex cache cgi cgid dav dav_fs dav_lock deflate dir disk_cache env expires ext_filter file_cache filter headers include info log_config logio mem_cache mime mime_magic negotiation rewrite setenvif speling status unique_id userdir usertrack vhost_alias" CALLIGRA_FEATURES="karbon sheets words" CAMERAS="kodak ptp2" COLLECTD_PLUGINS="df interface irq load memory rrdtool swap syslog" CPU_FLAGS_X86="3dnow 3dnowext mmx mmxext popcnt sse sse2 sse3 sse4a" CURL_SSL="gnutls" ELIBC="glibc" GPSD_PROTOCOLS="ashtech aivdm earthmate evermore fv18 garmin garmintxt gpsclock greis isync itrax mtk3301 nmea ntrip navcom oceanserver oldstyle oncore rtcm104v2 rtcm104v3 sirf skytraq superstar2 timing tsip tripmate tnt ublox ubx" GRUB_PLATFORMS="pc" INPUT_DEVICES="libinput" KERNEL="linux" L10N="it en" LCD_DEVICES="bayrad cfontz cfontz633 glk hd44780 lb216 lcdm001 mtxorb ncurses text" LIBREOFFICE_EXTENSIONS="nlpsolver" OFFICE_IMPLEMENTATION="libreoffice" PHP_TARGETS="php7-2" POSTGRES_TARGETS="postgres10 postgres11" PYTHON_SINGLE_TARGET="python3_7" PYTHON_TARGETS="python3_7" RUBY_TARGETS="ruby25" SANE_BACKENDS="epson epson2" USERLAND="GNU" VIDEO_CARDS="radeon r600" XTABLES_ADDONS="quota2 psd pknock lscan length2 ipv4options ipset ipp2p iface geoip fuzzy condition tee tarpit sysrq steal rawnat logmark ipmark dhcpmac delude chaos account"
Unset:  CC, CPPFLAGS, CTARGET, CXX, INSTALL_MASK, LC_ALL, PORTAGE_BINHOST, PORTAGE_BUNZIP2_COMMAND, PORTAGE_COMPRESS, PORTAGE_COMPRESS_FLAGS, PORTAGE_RSYNC_EXTRA_OPTS

=================================================================
                        Package Settings
=================================================================

sys-devel/gdb-9.1::gentoo was built with the following:
USE="client lzma nls python server source-highlight xml xxhash -multitarget -test -vanilla" ABI_X86="(64)" PYTHON_SINGLE_TARGET="python3_7 -python3_6"
FEATURES="split-elog userfetch userpriv pid-sandbox network-sandbox distcc unknown-features-warn unmerge-logs split-log ipc-sandbox unmerge-orphans protect-owned ebuild-locks strict compress-build-logs config-protect-if-modified qa-unresolved-soname-deps distlocks merge-sync multilib-strict binpkg-docompress preserve-libs assume-digests binpkg-logs xattr binpkg-dostrip usersync usersandbox news sandbox sfperms parallel-fetch cgroup"

# emerge -1pqv =sys-devel/gdb-9.1
[ebuild   R   ] sys-devel/gdb-9.1  USE="client lzma nls python server source-highlight test* xml xxhash -multitarget -vanilla" PYTHON_SINGLE_TARGET="python3_7 -python3_6"
Comment 1 Rolf Eike Beer 2020-03-16 17:49:05 UTC
Created attachment 620704 [details]
build.log

hppa is way worse:

# of expected passes            50941
# of unexpected failures        10575
# of unexpected successes       3
# of expected failures          49
# of unknown successes          5
# of known failures             77
# of untested testcases         80
# of unresolved testcases       29
# of unsupported tests          328