Gentoo Websites Logo
Go to: Gentoo Home Documentation Forums Lists Bugs Planet Store Wiki Get Gentoo!
Bug 704768 - sci-electronics/geda-1.9.2-r1 - FAIL: unit-tests/t0402-config.scm
Summary: sci-electronics/geda-1.9.2-r1 - FAIL: unit-tests/t0402-config.scm
Status: UNCONFIRMED
Alias: None
Product: Gentoo Linux
Classification: Unclassified
Component: Current packages (show other bugs)
Hardware: PPC Linux
: Normal normal (vote)
Assignee: The Soldering-Iron Brotherhood
URL:
Whiteboard:
Keywords: TESTFAILURE
Depends on:
Blocks:
 
Reported: 2020-01-04 14:48 UTC by ernsteiswuerfel
Modified: 2020-01-05 13:15 UTC (History)
0 users

See Also:
Package list:
Runtime testing required: ---


Attachments
emerge --info (file_704768.txt,5.93 KB, text/plain)
2020-01-04 14:48 UTC, ernsteiswuerfel
Details
build.log (geda-1.9.2-r1:20200104-142418.log,317.87 KB, text/plain)
2020-01-04 14:50 UTC, ernsteiswuerfel
Details
test-suite.log (test-suite.log,2.52 KB, text/plain)
2020-01-04 14:51 UTC, ernsteiswuerfel
Details

Note You need to log in before you can comment on or make changes to this bug.
Description ernsteiswuerfel 2020-01-04 14:48:34 UTC
Created attachment 602530 [details]
emerge --info

[...]
FAIL: unit-tests/t0402-config.scm
PASS: unit-tests/t1000-deprecated.scm
============================================================================
Testsuite summary for gEDA/gaf 1.9.2
============================================================================
# TOTAL: 29
# PASS:  27
# SKIP:  0
# XFAIL: 1
# FAIL:  1
# XPASS: 0
# ERROR: 0
============================================================================
See libgeda/scheme/test-suite.log
Please report to https://bugs.launchpad.net/geda
============================================================================
make[5]: *** [Makefile:758: test-suite.log] Error 1
make[5]: Leaving directory '/var/tmp/portage/sci-electronics/geda-1.9.2-r1/work/geda-gaf-1.9.2/libgeda/scheme'
make[4]: *** [Makefile:866: check-TESTS] Error 2
make[4]: Leaving directory '/var/tmp/portage/sci-electronics/geda-1.9.2-r1/work/geda-gaf-1.9.2/libgeda/scheme'
make[3]: *** [Makefile:932: check-am] Error 2
make[3]: Leaving directory '/var/tmp/portage/sci-electronics/geda-1.9.2-r1/work/geda-gaf-1.9.2/libgeda/scheme'
make[2]: *** [Makefile:554: check-recursive] Error 1
make[2]: Leaving directory '/var/tmp/portage/sci-electronics/geda-1.9.2-r1/work/geda-gaf-1.9.2/libgeda'
make[1]: *** [Makefile:579: check-recursive] Error 1
make[1]: Leaving directory '/var/tmp/portage/sci-electronics/geda-1.9.2-r1/work/geda-gaf-1.9.2'
make: *** [Makefile:872: check] Error 2
 * ERROR: sci-electronics/geda-1.9.2-r1::gentoo failed (test phase):
 *   emake failed
Comment 1 ernsteiswuerfel 2020-01-04 14:50:54 UTC
Created attachment 602532 [details]
build.log
Comment 2 ernsteiswuerfel 2020-01-04 14:51:16 UTC
Created attachment 602534 [details]
test-suite.log