Gentoo Websites Logo
Go to: Gentoo Home Documentation Forums Lists Bugs Planet Store Wiki Get Gentoo!
Bug 699046 - dev-python/wxpython-4.0.6: <built-in>: fatal error: when writing output to : No such file or directory
Summary: dev-python/wxpython-4.0.6: <built-in>: fatal error: when writing output to : ...
Status: CONFIRMED
Alias: None
Product: Gentoo Linux
Classification: Unclassified
Component: Current packages (show other bugs)
Hardware: All Linux
: Normal normal (vote)
Assignee: Gentoo wxWidgets Herd
URL:
Whiteboard:
Keywords:
Depends on:
Blocks:
 
Reported: 2019-10-31 18:53 UTC by Michał Górny
Modified: 2019-10-31 18:53 UTC (History)
1 user (show)

See Also:
Package list:
Runtime testing required: ---


Attachments
/var/log/portage/dev-python:wxpython-4.0.6:20191031-173425.log (dev-python:wxpython-4.0.6:20191031-173425.log,138.51 KB, text/plain)
2019-10-31 18:53 UTC, Michał Górny
Details

Note You need to log in before you can comment on or make changes to this bug.
Description Michał Górny archtester Gentoo Infrastructure gentoo-dev Security 2019-10-31 18:53:32 UTC
Created attachment 594682 [details]
/var/log/portage/dev-python:wxpython-4.0.6:20191031-173425.log

[530/858] Compiling sip/cpp/sip_dataviewwxDataViewListCtrl.cpp
collect2: error: ld returned 1 exit status
distcc[7524] ERROR: compile (null) on localhost failed

<built-in>: fatal error: when writing output to : No such file or directory
compilation terminated.
distcc[7610] ERROR: compile ../../../../sip/cpp/sip_dataviewwxDataViewListCtrl.cpp on pomiocik/3 failed
distcc[7610] (dcc_build_somewhere) Warning: remote compilation of '../../../../sip/cpp/sip_dataviewwxDataViewListCtrl.cpp' failed, retrying locally
distcc[7610] Warning: failed to distribute ../../../../sip/cpp/sip_dataviewwxDataViewListCtrl.cpp to pomiocik/3, running locally instead
distcc[7610] (dcc_please_send_email_after_investigation) Warning: remote compilation of '../../../../sip/cpp/sip_dataviewwxDataViewListCtrl.cpp' failed, retried locally and got a different result.

Waf: Leaving directory `/tmp/portage/dev-python/wxpython-4.0.6/work/wxPython-4.0.6/build/waf/3.6/gtk3'
Build failed


Looks like some waf-ism.