Gentoo Websites Logo
Go to: Gentoo Home Documentation Forums Lists Bugs Planet Store Wiki Get Gentoo!
Bug 695174 - dev-python/cryptography-2.6.1 fails TestECDSACertificate::test_load_ecdsa_no_named_curve after upgrade to openssl-1.0.2t-r1
Summary: dev-python/cryptography-2.6.1 fails TestECDSACertificate::test_load_ecdsa_no_...
Status: UNCONFIRMED
Alias: None
Product: Gentoo Linux
Classification: Unclassified
Component: Current packages (show other bugs)
Hardware: All Linux
: Normal normal (vote)
Assignee: Python Gentoo Team
URL:
Whiteboard:
Keywords: TESTFAILURE
Depends on:
Blocks:
 
Reported: 2019-09-20 09:09 UTC by Paolo Pedroni
Modified: 2019-09-26 19:04 UTC (History)
0 users

See Also:
Package list:
Runtime testing required: ---


Attachments
cryptography-2.6.1:20190920-073421.log.xz (cryptography-2.6.1:20190920-073421.log.xz,53.44 KB, application/x-xz)
2019-09-20 09:12 UTC, Paolo Pedroni
Details

Note You need to log in before you can comment on or make changes to this bug.
Description Paolo Pedroni 2019-09-20 09:09:28 UTC
[...]
tests/x509/test_x509.py::TestECDSACertificate::test_load_ecdsa_no_named_curve FAILED                                          [ 99%]

============================================================= FAILURES ==============================================================
________________________________________ TestECDSACertificate.test_load_ecdsa_no_named_curve ________________________________________

self = <tests.x509.test_x509.TestECDSACertificate object at 0x0000561eb563ff30>
backend = <cryptography.hazmat.backends.openssl.backend.Backend object at 0x0000561ea20a3c58>

    def test_load_ecdsa_no_named_curve(self, backend):
        _skip_curve_unsupported(backend, ec.SECP256R1())
        cert = _load_cert(
            os.path.join("x509", "custom", "ec_no_named_curve.pem"),
            x509.load_pem_x509_certificate,
            backend
        )
        with pytest.raises(NotImplementedError):
>           cert.public_key()
E           Failed: DID NOT RAISE <type 'exceptions.NotImplementedError'>

tests/x509/test_x509.py:3722: Failed
===Flaky Test Report===


===End Flaky Test Report===
====================================== 1 failed, 97457 passed, 9043 skipped in 408.49 seconds =======================================
 * ERROR: dev-python/cryptography-2.6.1::gentoo failed (test phase):
 *   Tests fail with pypy

This happens with any python implementation I've tried (pypy, python2_7, python3_6)

# emerge --info =dev-python/cryptography-2.6.1
Portage 2.3.69 (python 3.6.5-final-0, default/linux/amd64/17.1/desktop, gcc-9.2.0, glibc-2.29-r2, 5.2.15-gentoo x86_64)
=================================================================
                         System Settings
=================================================================
System uname: Linux-5.2.15-gentoo-x86_64-AMD_Phenom-tm-_II_X4_965_Processor-with-gentoo-2.6
KiB Mem:    12260632 total,   6035392 free
KiB Swap:    8351740 total,   8319852 free
Timestamp of repository gentoo: Tue, 17 Sep 2019 10:45:01 +0000
Head commit of repository gentoo: 4a060c966ddefc85e9fbf4d112ceffb91c077df1
sh dash 0.5.9.1-r3
ld GNU gold (Gentoo 2.32 p2 2.32.0) 1.16
distcc 3.3.3 x86_64-pc-linux-gnu [enabled]
ccache version 3.7.2 [disabled]
app-shells/bash:          4.4_p23-r1::gentoo
dev-java/java-config:     2.2.0-r4::gentoo
dev-lang/perl:            5.28.2-r1::gentoo
dev-lang/python:          2.7.15::gentoo, 3.6.5::gentoo
dev-util/ccache:          3.7.2::gentoo
dev-util/cmake:           3.14.6::gentoo
sys-apps/baselayout:      2.6-r1::gentoo
sys-apps/sandbox:         2.13::gentoo
sys-devel/autoconf:       2.13-r1::gentoo, 2.69-r4::gentoo
sys-devel/automake:       1.16.1-r1::gentoo
sys-devel/binutils:       2.32-r1::gentoo
sys-devel/gcc:            9.2.0::gentoo
sys-devel/gcc-config:     2.0::gentoo
sys-devel/libtool:        2.4.6-r3::gentoo
sys-devel/make:           4.2.1-r4::gentoo
sys-kernel/linux-headers: 4.19::gentoo (virtual/os-headers)
sys-libs/glibc:           2.29-r2::gentoo
Repositories:

gentoo
    location: /usr/portage
    sync-type: rsync
    sync-uri: rsync://rsync.europe.gentoo.org/gentoo-portage
    priority: -1000
    sync-rsync-verify-jobs: 1
    sync-rsync-verify-metamanifest: yes
    sync-rsync-verify-max-age: 24
    sync-rsync-extra-opts: 

x-portage
    location: /usr/local/portage
    masters: gentoo
    priority: 0

ACCEPT_KEYWORDS="amd64"
ACCEPT_LICENSE="* -@EULA"
CBUILD="x86_64-pc-linux-gnu"
CFLAGS="-O2 -pipe -frecord-gcc-switches -march=amdfam10 -flto=5"
CHOST="x86_64-pc-linux-gnu"
CONFIG_PROTECT="/etc /usr/lib64/libreoffice/program/sofficerc /usr/share/config /usr/share/gnupg/qualified.txt"
CONFIG_PROTECT_MASK="/etc/ca-certificates.conf /etc/dconf /etc/env.d /etc/fonts/fonts.conf /etc/gconf /etc/gentoo-release /etc/revdep-rebuild /etc/sandbox.d /etc/terminfo"
CXXFLAGS="-O2 -pipe -frecord-gcc-switches -march=amdfam10 -flto=5"
DISTDIR="/usr/portage/distfiles"
EMERGE_DEFAULT_OPTS="--keep-going y --with-bdeps y"
ENV_UNSET="DBUS_SESSION_BUS_ADDRESS DISPLAY GOBIN PERL5LIB PERL5OPT PERLPREFIX PERL_CORE PERL_MB_OPT PERL_MM_OPT XAUTHORITY XDG_CACHE_HOME XDG_CONFIG_HOME XDG_DATA_HOME XDG_RUNTIME_DIR"
FCFLAGS="-O2 -pipe -frecord-gcc-switches -march=amdfam10 -flto=5"
FEATURES="assume-digests binpkg-docompress binpkg-dostrip binpkg-logs cgroup compress-build-logs config-protect-if-modified distcc distlocks ebuild-locks ipc-sandbox merge-sync multilib-strict network-sandbox news parallel-fetch pid-sandbox preserve-libs protect-owned sandbox sfperms split-elog split-log strict test unknown-features-warn unmerge-logs unmerge-orphans userfetch userpriv usersandbox usersync xattr"
FFLAGS="-O2 -pipe -frecord-gcc-switches -march=amdfam10 -flto=5"
GENTOO_MIRRORS="http://mirrors.evowise.com/gentoo/ https://mirrors.evowise.com/gentoo/ http://mirror.eu.oneandone.net/linux/distributions/gentoo/gentoo/ http://mirror.netcologne.de/gentoo/"
LANG="it_IT.UTF-8"
LDFLAGS="-Wl,-O1 -Wl,--as-needed -Wl,--hash-style=gnu -Wl,--sort-common -flto=5"
LINGUAS="it it_IT"
MAKEOPTS="-j19 -l4"
PKGDIR="/usr/portage/packages"
PORTAGE_CONFIGROOT="/"
PORTAGE_RSYNC_OPTS="--recursive --links --safe-links --perms --times --omit-dir-times --compress --force --whole-file --delete --stats --human-readable --timeout=180 --exclude=/distfiles --exclude=/local --exclude=/packages --exclude=/.git"
PORTAGE_TMPDIR="/var/tmp"
USE="3dnow X a52 aac aalib acl acpi alsa amd64 ao audiofile bash-completion bluetooth branding bzip2 cairo caps cdda cddb cdparanoia cdr cli consolekit crypt css cups curl cxx dbus dga djvu dri dts dvd dvdr emboss encode exif expat fbcon ffmpeg fftw flac fontconfig fortran ftp gd gdbm gif glamor gmp gnutls gpm graphviz gtk iconv icu idn ieee1394 imagemagick imlib inotify introspection ipv6 java jbig jpeg jpeg2k kde lame lcms libass libnotify libsamplerate libtirpc lm_sensors lua lzma lzo mad mmap mng mp3 mp4 mpeg mplayer multilib musicbrainz ncurses nls nptl nsplugin offensive ogg openal opengl openmp pam pango pcre pdf png policykit postscript ppds pulseaudio qt5 rdesktop readline samba sctp sdl seccomp sndfile speex spell split-usr sqlite ssl startup-notification svg symlink syslog systemd taglib test theora threads tiff truetype udev udisks unicode upower usb vaapi vcd vdpau vim-syntax vorbis wavpack wayland win32codecs wmf wxwidgets x264 xattr xcb xcomposite xine xinerama xml xpm xscreensaver xv xvid zlib" ABI_X86="64" ADA_TARGET="gnat_2018" ALSA_CARDS="hda-intel virmidi" APACHE2_MODULES="authn_core authz_core socache_shmcb unixd actions alias auth_basic authn_alias authn_anon authn_dbm authn_default authn_file authz_dbm authz_default authz_groupfile authz_host authz_owner authz_user autoindex cache cgi cgid dav dav_fs dav_lock deflate dir disk_cache env expires ext_filter file_cache filter headers include info log_config logio mem_cache mime mime_magic negotiation rewrite setenvif speling status unique_id userdir usertrack vhost_alias" CALLIGRA_FEATURES="karbon sheets words" CAMERAS="kodak ptp2" COLLECTD_PLUGINS="df interface irq load memory rrdtool swap syslog" CPU_FLAGS_X86="3dnow 3dnowext mmx mmxext popcnt sse sse2 sse3 sse4a" CURL_SSL="gnutls" ELIBC="glibc" GPSD_PROTOCOLS="ashtech aivdm earthmate evermore fv18 garmin garmintxt gpsclock isync itrax mtk3301 nmea ntrip navcom oceanserver oldstyle oncore rtcm104v2 rtcm104v3 sirf skytraq superstar2 timing tsip tripmate tnt ublox ubx" GRUB_PLATFORMS="pc" INPUT_DEVICES="libinput" KERNEL="linux" L10N="it en" LCD_DEVICES="bayrad cfontz cfontz633 glk hd44780 lb216 lcdm001 mtxorb ncurses text" NETBEANS_MODULES="apisupport cnd groovy gsf harness ide identity j2ee java mobility nb php profiler soa visualweb webcommon websvccommon xml" OFFICE_IMPLEMENTATION="libreoffice" PHP_TARGETS="php7-2" POSTGRES_TARGETS="postgres10 postgres11" PYTHON_SINGLE_TARGET="python3_6" PYTHON_TARGETS="python2_7 python3_6 pypy pypy3" USERLAND="GNU" VIDEO_CARDS="radeon r600" XTABLES_ADDONS="quota2 psd pknock lscan length2 ipv4options ipset ipp2p iface geoip fuzzy condition tee tarpit sysrq steal rawnat logmark ipmark dhcpmac delude chaos account"
Unset:  CC, CPPFLAGS, CTARGET, CXX, INSTALL_MASK, LC_ALL, PORTAGE_BINHOST, PORTAGE_BUNZIP2_COMMAND, PORTAGE_COMPRESS, PORTAGE_COMPRESS_FLAGS, PORTAGE_RSYNC_EXTRA_OPTS

=================================================================
                        Package Settings
=================================================================

dev-python/cryptography-2.6.1::gentoo was built with the following:
USE="test -idna -libressl" ABI_X86="(64)" PYTHON_TARGETS="pypy pypy3 python2_7 python3_6 -python3_5 (-python3_7)"
CFLAGS="-O2 -pipe -frecord-gcc-switches -march=amdfam10 -flto=5 -pthread"

# emerge -1pqv =dev-python/cryptography-2.6.1
[ebuild   R   ] dev-python/cryptography-2.6.1  USE="test -idna -libressl" PYTHON_TARGETS="pypy pypy3 python2_7 python3_6 -python3_5 (-python3_7)"
Comment 1 Paolo Pedroni 2019-09-20 09:12:08 UTC
Created attachment 590398 [details]
cryptography-2.6.1:20190920-073421.log.xz
Comment 2 Paolo Pedroni 2019-09-20 09:36:04 UTC
dev-python/cryptography-2.7 fails with the same error.