Gentoo Websites Logo
Go to: Gentoo Home Documentation Forums Lists Bugs Planet Store Wiki Get Gentoo!
Bugzilla DB migration completed. Please report issues to Infra team via email via infra@gentoo.org or IRC
Bug 691156 - sys-apps/pick-3.0.1 : collect2: error: ld returned 1 exit status
Summary: sys-apps/pick-3.0.1 : collect2: error: ld returned 1 exit status
Status: CONFIRMED
Alias: None
Product: Gentoo Linux
Classification: Unclassified
Component: Current packages (show other bugs)
Hardware: All Linux
: Normal normal with 1 vote (vote)
Assignee: No maintainer - Look at https://wiki.gentoo.org/wiki/Project:Proxy_Maintainers if you want to take care of it
URL:
Whiteboard:
Keywords:
Depends on:
Blocks:
 
Reported: 2019-07-31 17:44 UTC by Toralf Förster
Modified: 2019-11-17 05:28 UTC (History)
0 users

See Also:
Package list:
Runtime testing required: ---


Attachments
emerge-info.txt (emerge-info.txt,17.13 KB, text/plain)
2019-07-31 17:44 UTC, Toralf Förster
Details
emerge-history.txt (emerge-history.txt,230.12 KB, text/plain)
2019-07-31 17:44 UTC, Toralf Förster
Details
environment (environment,62.12 KB, text/plain)
2019-07-31 17:44 UTC, Toralf Förster
Details
etc.portage.tbz2 (etc.portage.tbz2,14.16 KB, application/x-bzip)
2019-07-31 17:44 UTC, Toralf Förster
Details
logs.tbz2 (logs.tbz2,565 bytes, application/x-bzip)
2019-07-31 17:44 UTC, Toralf Förster
Details
sys-apps:pick-3.0.1:20190731-041320.log (sys-apps:pick-3.0.1:20190731-041320.log,2.65 KB, text/plain)
2019-07-31 17:44 UTC, Toralf Förster
Details
temp.tbz2 (temp.tbz2,16.68 KB, application/x-bzip)
2019-07-31 17:44 UTC, Toralf Förster
Details

Note You need to log in before you can comment on or make changes to this bug.
Description Toralf Förster gentoo-dev 2019-07-31 17:44:27 UTC
/usr/lib/gcc/x86_64-pc-linux-gnu/9.1.0/../../../../x86_64-pc-linux-gnu/bin/ld: /var/tmp/portage/sys-apps/pick-3.0.1/temp/ccyjQbgW.o: undefined reference to symbol 'setupterm'
/usr/lib/gcc/x86_64-pc-linux-gnu/9.1.0/../../../../x86_64-pc-linux-gnu/bin/ld: /lib64/libtinfo.so.6: error adding symbols: DSO missing from command line
collect2: error: ld returned 1 exit status
+ LDFLAGS=-lncursesw
+ check_curses
+ compile

  -------------------------------------------------------------------

  This is an unstable amd64 chroot image at a tinderbox (==build bot)
  name: 17.1-20190726-194018

  -------------------------------------------------------------------

gcc-config -l:
 [1] x86_64-pc-linux-gnu-9.1.0 *

Available Python interpreters, in order of preference:
  [1]   python3.6
  [2]   python2.7 (fallback)
Available Ruby profiles:
  [1]   ruby24 (with Rubygems) *
Available Rust versions:
  [1]   rust-1.36.0 *



emerge -qpvO sys-apps/pick
[ebuild  N    ] sys-apps/pick-3.0.1
Comment 1 Toralf Förster gentoo-dev 2019-07-31 17:44:30 UTC
Created attachment 585284 [details]
emerge-info.txt
Comment 2 Toralf Förster gentoo-dev 2019-07-31 17:44:32 UTC
Created attachment 585286 [details]
emerge-history.txt
Comment 3 Toralf Förster gentoo-dev 2019-07-31 17:44:35 UTC
Created attachment 585288 [details]
environment
Comment 4 Toralf Förster gentoo-dev 2019-07-31 17:44:37 UTC
Created attachment 585290 [details]
etc.portage.tbz2
Comment 5 Toralf Förster gentoo-dev 2019-07-31 17:44:40 UTC
Created attachment 585292 [details]
logs.tbz2
Comment 6 Toralf Förster gentoo-dev 2019-07-31 17:44:42 UTC
Created attachment 585294 [details]
sys-apps:pick-3.0.1:20190731-041320.log
Comment 7 Toralf Förster gentoo-dev 2019-07-31 17:44:45 UTC
Created attachment 585296 [details]
temp.tbz2