Gentoo Websites Logo
Go to: Gentoo Home Documentation Forums Lists Bugs Planet Store Wiki Get Gentoo!
Bug 683768 - dev-db/redis-5.0.3 : [TEST] make[1]: *** [Makefile:<snip>: test] Error 1
Summary: dev-db/redis-5.0.3 : [TEST] make[1]: *** [Makefile:<snip>: test] Error 1
Status: CONFIRMED
Alias: None
Product: Gentoo Linux
Classification: Unclassified
Component: Current packages (show other bugs)
Hardware: All Linux
: Normal normal (vote)
Assignee: Robin Johnson
URL:
Whiteboard:
Keywords: TESTFAILURE
Depends on:
Blocks:
 
Reported: 2019-04-18 14:24 UTC by Toralf Förster
Modified: 2019-04-18 18:56 UTC (History)
1 user (show)

See Also:
Package list:
Runtime testing required: ---


Attachments
emerge-info.txt (emerge-info.txt,15.09 KB, text/plain)
2019-04-18 14:24 UTC, Toralf Förster
Details
dev-db:redis-5.0.3:20190417-235407.log (dev-db:redis-5.0.3:20190417-235407.log,83.54 KB, text/plain)
2019-04-18 14:24 UTC, Toralf Förster
Details
emerge-history.txt (emerge-history.txt,33.16 KB, text/plain)
2019-04-18 14:24 UTC, Toralf Förster
Details
environment (environment,123.60 KB, text/plain)
2019-04-18 14:24 UTC, Toralf Förster
Details
etc.portage.tbz2 (etc.portage.tbz2,11.72 KB, application/x-bzip)
2019-04-18 14:24 UTC, Toralf Förster
Details
logs.tbz2 (logs.tbz2,5.92 KB, application/x-bzip)
2019-04-18 14:24 UTC, Toralf Förster
Details
temp.tbz2 (temp.tbz2,36.20 KB, application/x-bzip)
2019-04-18 14:24 UTC, Toralf Förster
Details
tests.tbz2 (tests.tbz2,96.33 KB, application/x-bzip)
2019-04-18 14:24 UTC, Toralf Förster
Details

Note You need to log in before you can comment on or make changes to this bug.
Description Toralf Förster gentoo-dev 2019-04-18 14:24:07 UTC
Killing still running Redis server 780

make[1]: *** [Makefile:256: test] Error 1
make[1]: Leaving directory '/var/tmp/portage/dev-db/redis-5.0.3/work/redis-5.0.3/src'
make: *** [Makefile:6: check] Error 2
 * ERROR: dev-db/redis-5.0.3::gentoo failed (test phase):

  -------------------------------------------------------------------

  This is an unstable amd64 chroot image at a tinderbox (==build bot)
  name: 17.0-no-multilib-hardened_libressl-test_20190417-081848

  -------------------------------------------------------------------

gcc-config -l:
 [1] x86_64-pc-linux-gnu-8.3.0 *

Available Python interpreters, in order of preference:
  [1]   python3.6
  [2]   python2.7 (fallback)





emerge -qpvO dev-db/redis
[ebuild  N    ] dev-db/redis-5.0.3  USE="jemalloc test -luajit -tcmalloc"
Comment 1 Toralf Förster gentoo-dev 2019-04-18 14:24:10 UTC
Created attachment 573318 [details]
emerge-info.txt
Comment 2 Toralf Förster gentoo-dev 2019-04-18 14:24:13 UTC
Created attachment 573320 [details]
dev-db:redis-5.0.3:20190417-235407.log
Comment 3 Toralf Förster gentoo-dev 2019-04-18 14:24:16 UTC
Created attachment 573322 [details]
emerge-history.txt
Comment 4 Toralf Förster gentoo-dev 2019-04-18 14:24:19 UTC
Created attachment 573324 [details]
environment
Comment 5 Toralf Förster gentoo-dev 2019-04-18 14:24:22 UTC
Created attachment 573326 [details]
etc.portage.tbz2
Comment 6 Toralf Förster gentoo-dev 2019-04-18 14:24:25 UTC
Created attachment 573328 [details]
logs.tbz2
Comment 7 Toralf Förster gentoo-dev 2019-04-18 14:24:28 UTC
Created attachment 573330 [details]
temp.tbz2
Comment 8 Toralf Förster gentoo-dev 2019-04-18 14:24:30 UTC
Created attachment 573332 [details]
tests.tbz2