Gentoo Websites Logo
Go to: Gentoo Home Documentation Forums Lists Bugs Planet Store Wiki Get Gentoo!
Bug 681748 - dev-php/pecl-haru-1.0.4-r2 : collect2: error: ld returned 1 exit status
Summary: dev-php/pecl-haru-1.0.4-r2 : collect2: error: ld returned 1 exit status
Status: CONFIRMED
Alias: None
Product: Gentoo Linux
Classification: Unclassified
Component: Current packages (show other bugs)
Hardware: All Linux
: Normal normal (vote)
Assignee: PHP Bugs
URL:
Whiteboard:
Keywords:
Depends on:
Blocks:
 
Reported: 2019-03-25 17:52 UTC by Toralf Förster
Modified: 2019-03-25 17:52 UTC (History)
0 users

See Also:
Package list:
Runtime testing required: ---


Attachments
emerge-info.txt (emerge-info.txt,16.35 KB, text/plain)
2019-03-25 17:52 UTC, Toralf Förster
Details
dev-php:pecl-haru-1.0.4-r2:20190325-172636.log (dev-php:pecl-haru-1.0.4-r2:20190325-172636.log,10.45 KB, text/plain)
2019-03-25 17:52 UTC, Toralf Förster
Details
emerge-history.txt (emerge-history.txt,131.59 KB, text/plain)
2019-03-25 17:52 UTC, Toralf Förster
Details
environment (environment,62.68 KB, text/plain)
2019-03-25 17:52 UTC, Toralf Förster
Details
etc.portage.tbz2 (etc.portage.tbz2,11.58 KB, application/x-bzip)
2019-03-25 17:52 UTC, Toralf Förster
Details
logs.tbz2 (logs.tbz2,6.33 KB, application/x-bzip)
2019-03-25 17:52 UTC, Toralf Förster
Details
temp.tbz2 (temp.tbz2,20.04 KB, application/x-bzip)
2019-03-25 17:52 UTC, Toralf Förster
Details

Note You need to log in before you can comment on or make changes to this bug.
Description Toralf Förster gentoo-dev 2019-03-25 17:52:29 UTC
libtool: link: x86_64-pc-linux-gnu-gcc -shared  -fPIC -DPIC  .libs/haru.o   -Wl,--as-needed -L/usr//lib /usr/lib/libhpdf.so -L/usr/lib -lm -lpng -lz  -O2 -march=native -Wl,-O1 -Wl,-rpath -Wl,/usr//lib   -Wl,-soname -Wl,haru.so -o .libs/haru.so
/usr/lib/libhpdf.so: error adding symbols: File in wrong format
collect2: error: ld returned 1 exit status
make: *** [Makefile:186: haru.la] Error 1
 * ERROR: dev-php/pecl-haru-1.0.4-r2::gentoo failed (compile phase):
 *   emake failed

  -------------------------------------------------------------------

  This is an unstable amd64 chroot image at a tinderbox (==build bot)
  name: 17.1-desktop-plasma-systemd_abi32+64_20190321-101852

  -------------------------------------------------------------------

gcc-config -l:
 [1] x86_64-pc-linux-gnu-8.3.0 *

Available Python interpreters, in order of preference:
  [1]   python3.6
  [2]   python2.7 (fallback)

Available Rust versions:
  [1]   rust-1.32.0 *
java-config:
The following VMs are available for generation-2:
*)	IcedTea JDK 3.10.0 [icedtea-bin-8]
Available Java Virtual Machines:
  [1]   icedtea-bin-8  system-vm

emerge -qpvO dev-php/pecl-haru
[ebuild  N    ] dev-php/pecl-haru-1.0.4-r2  USE="png zlib" PHP_TARGETS="php5-6"
Comment 1 Toralf Förster gentoo-dev 2019-03-25 17:52:32 UTC
Created attachment 570730 [details]
emerge-info.txt
Comment 2 Toralf Förster gentoo-dev 2019-03-25 17:52:35 UTC
Created attachment 570732 [details]
dev-php:pecl-haru-1.0.4-r2:20190325-172636.log
Comment 3 Toralf Förster gentoo-dev 2019-03-25 17:52:38 UTC
Created attachment 570734 [details]
emerge-history.txt
Comment 4 Toralf Förster gentoo-dev 2019-03-25 17:52:40 UTC
Created attachment 570736 [details]
environment
Comment 5 Toralf Förster gentoo-dev 2019-03-25 17:52:43 UTC
Created attachment 570738 [details]
etc.portage.tbz2
Comment 6 Toralf Förster gentoo-dev 2019-03-25 17:52:46 UTC
Created attachment 570740 [details]
logs.tbz2
Comment 7 Toralf Förster gentoo-dev 2019-03-25 17:52:49 UTC
Created attachment 570742 [details]
temp.tbz2