Gentoo Websites Logo
Go to: Gentoo Home Documentation Forums Lists Bugs Planet Store Wiki Get Gentoo!
Bug 678830 - sys-devel/gcc-8.3.0 fails tests
Summary: sys-devel/gcc-8.3.0 fails tests
Status: CONFIRMED
Alias: None
Product: Gentoo Linux
Classification: Unclassified
Component: Current packages (show other bugs)
Hardware: All Linux
: Normal normal (vote)
Assignee: Gentoo Toolchain Maintainers
URL:
Whiteboard:
Keywords: TESTFAILURE
Depends on:
Blocks:
 
Reported: 2019-02-26 13:18 UTC by Paolo Pedroni
Modified: 2020-07-24 08:05 UTC (History)
4 users (show)

See Also:
Package list:
Runtime testing required: ---


Attachments
gcc-build-logs.tar.bz2 (gcc-build-logs.tar.bz2,508.39 KB, application/x-bzip)
2019-02-26 13:20 UTC, Paolo Pedroni
Details
gcc-8.3.0:20190225-092156.log.xz.000 (gcc-8.3.0:20190225-092156.log.xz.000,976.56 KB, application/x-xz)
2019-02-26 13:28 UTC, Paolo Pedroni
Details
gcc-8.3.0:20190225-092156.log.xz.001 (gcc-8.3.0:20190225-092156.log.xz.001,976.56 KB, application/octet-stream)
2019-02-26 13:28 UTC, Paolo Pedroni
Details
gcc-8.3.0:20190225-092156.log.xz.002 (gcc-8.3.0:20190225-092156.log.xz.002,976.56 KB, application/octet-stream)
2019-02-26 13:29 UTC, Paolo Pedroni
Details
gcc-8.3.0:20190225-092156.log.xz.003 (gcc-8.3.0:20190225-092156.log.xz.003,838.50 KB, application/octet-stream)
2019-02-26 13:29 UTC, Paolo Pedroni
Details
test failures on sparc (sparc-fails.log,68.19 KB, text/x-log)
2019-05-07 19:02 UTC, Rolf Eike Beer
Details
build.log for 8.4.0 hppa (build.log.xz,143.52 KB, application/x-xz)
2020-06-16 16:47 UTC, Rolf Eike Beer
Details
build.log for 8.4.0-r1 for hppa (build.log.xz,144.72 KB, application/x-xz)
2020-07-23 18:55 UTC, Rolf Eike Beer
Details

Note You need to log in before you can comment on or make changes to this bug.
Description Paolo Pedroni 2019-02-26 13:18:21 UTC
[...]
Testing char/translate_nocase.cc
extra_tool_flags are:
  -include bits/stdc++.h
doing compile
pid is 21593 -21593
pid is -1
close result is 21593 exp8 0 1
output is /usr/x86_64-pc-linux-gnu/bin/ld: error: /var/tmp/portage_ondisk/portage/sys-devel/gcc-8.3.0/temp/ccAjuTSP.o: requires dyna
mic R_X86_64_PC32 reloc against '_Z24__VLTVerifyVtablePointerPPvPKv' which may overflow at runtime; recompile with -fPIC
collect2: error: ld returned 1 exit status
 status 1
compiler exited with status 1
FAIL: tr1/7_regular_expressions/regex_traits/char/translate_nocase.cc (test for excess errors)
[...]
Testing wchar_t/translate_nocase.cc
extra_tool_flags are:
  -include bits/stdc++.h
doing compile
pid is 21635 -21635
pid is -1
close result is 21635 exp8 0 1
output is /usr/x86_64-pc-linux-gnu/bin/ld: error: /var/tmp/portage_ondisk/portage/sys-devel/gcc-8.3.0/temp/cctoZD1j.o: requires dyna
mic R_X86_64_PC32 reloc against '_Z24__VLTVerifyVtablePointerPPvPKv' which may overflow at runtime; recompile with -fPIC
collect2: error: ld returned 1 exit status
 status 1
compiler exited with status 1
FAIL: tr1/7_regular_expressions/regex_traits/wchar_t/translate_nocase.cc (test for excess errors)
[...]
make[1]: Target 'check-target' not remade because of errors.
make[1]: Leaving directory '/var/tmp/portage_ondisk/portage/sys-devel/gcc-8.3.0/work/build'
make: *** [Makefile:2273: do-check] Error 2
make: Target 'check' not remade because of errors.
 * ERROR: sys-devel/gcc-8.3.0::gentoo failed (test phase):
 *   emake failed
 * 
 * If you need support, post the output of `emerge --info '=sys-devel/gcc-8.3.0::gentoo'`,
 * the complete build log and the output of `emerge -pqv '=sys-devel/gcc-8.3.0::gentoo'`.
 * The complete build log is located at '/var/log/portage/build/sys-devel/gcc-8.3.0:20190225-092156.log.gz'.
 * For convenience, a symlink to the build log is located at '/var/tmp/portage_ondisk/portage/sys-devel/gcc-8.3.0/temp/build.log.gz'.
 * The ebuild environment file is located at '/var/tmp/portage_ondisk/portage/sys-devel/gcc-8.3.0/temp/environment'.
 * Working directory: '/var/tmp/portage_ondisk/portage/sys-devel/gcc-8.3.0/work/build'
 * S: '/var/tmp/portage_ondisk/portage/sys-devel/gcc-8.3.0/work/gcc-8.3.0'
tar: build.log: Cannot stat: No such file or directory
tar: Exiting with failure status due to previous errors
rm: cannot remove 'build.log': No such file or directory
 * 
 * Please include /var/tmp/portage_ondisk/portage/sys-devel/gcc-8.3.0/work/gcc-build-logs.tar.bz2 in your bug report.
 *

...and many more, with different error messages. See complete build.log

# emerge --info =sys-devel/gcc-8.3.0
emerge --info =sys-devel/gcc-8.3.0
Portage 2.3.51 (python 3.6.5-final-0, default/linux/amd64/17.1/desktop/plasma/systemd, gcc-8.2.0, glibc-2.27-r6, 4.19.23-gentoo x86_64)
=================================================================
                         System Settings
=================================================================
System uname: Linux-4.19.23-gentoo-x86_64-Intel-R-_Pentium-R-_CPU_G640_@_2.80GHz-with-gentoo-2.6
KiB Mem:    12144624 total,   1305812 free
KiB Swap:    8388604 total,   8337660 free
Timestamp of repository gentoo: Mon, 25 Feb 2019 08:30:01 +0000
Head commit of repository gentoo: fa1ac49017a78b0091e213eb239f5bf6698e4a41
sh dash 0.5.9.1-r3
ld GNU gold (Gentoo 2.30 p5 2.30.0) 1.15
ccache version 3.3.4 [disabled]
app-shells/bash:          4.4_p23-r1::gentoo
dev-java/java-config:     2.2.0-r4::gentoo
dev-lang/perl:            5.26.2::gentoo
dev-lang/python:          2.7.15::gentoo, 3.6.5::gentoo
dev-util/ccache:          3.3.4-r1::gentoo
dev-util/cmake:           3.9.6::gentoo
dev-util/pkgconfig:       0.29.2::gentoo
sys-apps/baselayout:      2.6-r1::gentoo
sys-apps/sandbox:         2.13::gentoo
sys-devel/autoconf:       2.13-r1::gentoo, 2.69-r4::gentoo
sys-devel/automake:       1.16.1-r1::gentoo
sys-devel/binutils:       2.30-r4::gentoo
sys-devel/gcc:            8.2.0-r6::gentoo
sys-devel/gcc-config:     2.0::gentoo
sys-devel/libtool:        2.4.6-r3::gentoo
sys-devel/make:           4.2.1-r4::gentoo
sys-kernel/linux-headers: 4.17::gentoo (virtual/os-headers)
sys-libs/glibc:           2.27-r6::gentoo
Repositories:

gentoo
    location: /usr/portage
    sync-type: rsync
    sync-uri: rsync://rsync.gentoo.org/gentoo-portage
    priority: -1000
    sync-rsync-extra-opts: 
    sync-rsync-verify-jobs: 1
    sync-rsync-verify-metamanifest: yes
    sync-rsync-verify-max-age: 24

x-portage
    location: /usr/local/portage
    masters: gentoo
    priority: 0

ACCEPT_KEYWORDS="amd64"
ACCEPT_LICENSE="* -@EULA"
CBUILD="x86_64-pc-linux-gnu"
CFLAGS="-march=native -O2 -pipe -frecord-gcc-switches -flto=2"
CHOST="x86_64-pc-linux-gnu"
CONFIG_PROTECT="/etc /usr/lib64/libreoffice/program/sofficerc /usr/share/config /usr/share/gnupg/qualified.txt"
CONFIG_PROTECT_MASK="/etc/ca-certificates.conf /etc/dconf /etc/env.d /etc/fonts/fonts.conf /etc/gconf /etc/gentoo-release /etc/revdep-rebuild /etc/sandbox.d /etc/terminfo"
CXXFLAGS="-march=native -O2 -pipe -frecord-gcc-switches -flto=2"
DISTDIR="/usr/portage/distfiles"
EMERGE_DEFAULT_OPTS="--keep-going y --with-bdeps y"
ENV_UNSET="DBUS_SESSION_BUS_ADDRESS DISPLAY GOBIN PERL5LIB PERL5OPT PERLPREFIX PERL_CORE PERL_MB_OPT PERL_MM_OPT XAUTHORITY XDG_CACHE_HOME XDG_CONFIG_HOME XDG_DATA_HOME XDG_RUNTIME_DIR"
FCFLAGS="-march=native -O2 -pipe -frecord-gcc-switches -flto=2"
FEATURES="assume-digests binpkg-logs cgroup compress-build-logs config-protect-if-modified distlocks ebuild-locks ipc-sandbox merge-sync multilib-strict network-sandbox news parallel-fetch preserve-libs protect-owned sandbox sfperms sign split-elog split-log strict strict-keepdir test unknown-features-warn unmerge-logs unmerge-orphans userfetch userpriv usersandbox usersync xattr"
FFLAGS="-march=native -O2 -pipe -frecord-gcc-switches -flto=2"
GENTOO_MIRRORS="http://gentoo.mirrors.ovh.net/gentoo-distfiles/ https://mirrors.evowise.com/gentoo/ http://mirror.eu.oneandone.net/linux/distributions/gentoo/gentoo/"
LANG="it_IT.utf8"
LDFLAGS="-Wl,-O1 -Wl,--as-needed -Wl,--hash-style=gnu -Wl,--sort-common -flto=2"
LINGUAS="it it_IT"
MAKEOPTS="-j3 -l2"
PKGDIR="/usr/portage/packages"
PORTAGE_CONFIGROOT="/"
PORTAGE_RSYNC_OPTS="--recursive --links --safe-links --perms --times --omit-dir-times --compress --force --whole-file --delete --stats --human-readable --timeout=180 --exclude=/distfiles --exclude=/local --exclude=/packages --exclude=/.git"
PORTAGE_TMPDIR="/var/tmp"
USE="X a52 aac aalib acl acpi activities adns alsa amd64 ao audiofile bash-completion bluetooth branding bzip2 cairo caps cdda cddb cdparanoia cdr cli crypt css cups curl cxx dbus declarative dga djvu dri dts dvd dvdr emboss encode exif expat fbcon ffmpeg fftw flac fontconfig foomaticdb fortran ftp gd gdbm geoip gif gimp glamor gmp gnutls gphoto2 gpm graphviz gtk handbook iconv icu idn imagemagick imlib ipv6 java javascript jbig jpeg jpeg2k kde kipi kwallet lame lcms libass libcaca libnotify libsamplerate libtirpc lm_sensors lua lzma lzo mad mmap mng mp3 mp4 mpeg mplayer multilib musicbrainz ncurses nls nptl nsplugin offensive ogg openal opengl openmp pam pango pcre pdf phonon plasma png policykit postscript ppds pulseaudio qml qt5 rdesktop readline recode samba sctp sdl seccomp sndfile sockets speex spell sqlite ssl startup-notification subversion svg symlink syslog systemd sysvipc taglib test theora threads tidy tiff truetype udev udisks unicode upower usb vaapi vcd vim-syntax vnc vorbis wayland widgets win32codecs wmf wxwidgets x264 xattr xcb xcomposite xine xml xpm xscreensaver xv xvid yahoo zlib" ABI_X86="64" ALSA_CARDS="hda-intel virmidi" APACHE2_MODULES="authn_core authz_core socache_shmcb unixd actions alias auth_basic authn_alias authn_anon authn_dbm authn_default authn_file authz_dbm authz_default authz_groupfile authz_host authz_owner authz_user autoindex cache cgi cgid dav dav_fs dav_lock deflate dir disk_cache env expires ext_filter file_cache filter headers include info log_config logio mem_cache mime mime_magic negotiation rewrite setenvif speling status unique_id userdir usertrack vhost_alias" CALLIGRA_FEATURES="karbon sheets words" CAMERAS="kodak ptp2" COLLECTD_PLUGINS="df interface irq load memory rrdtool swap syslog" CPU_FLAGS_X86="mmx mmxext pclmul popcnt sse sse2 sse3 sse4_1 sse4_2 ssse3" CURL_SSL="gnutls" ELIBC="glibc" GPSD_PROTOCOLS="ashtech aivdm earthmate evermore fv18 garmin garmintxt gpsclock isync itrax mtk3301 nmea ntrip navcom oceanserver oldstyle oncore rtcm104v2 rtcm104v3 sirf skytraq superstar2 timing tsip tripmate tnt ublox ubx" INPUT_DEVICES="libinput" KERNEL="linux" L10N="it en" LCD_DEVICES="bayrad cfontz cfontz633 glk hd44780 lb216 lcdm001 mtxorb ncurses text" LIBREOFFICE_EXTENSIONS="nlpsolver" NETBEANS_MODULES="apisupport cnd groovy gsf harness ide identity j2ee java mobility nb php profiler soa visualweb webcommon websvccommon xml" OFFICE_IMPLEMENTATION="libreoffice" PHP_TARGETS="php5-6 php7-1" POSTGRES_TARGETS="postgres9_5 postgres10" PYTHON_SINGLE_TARGET="python3_6" PYTHON_TARGETS="python2_7 python3_6 pypy pypy3" RUBY_TARGETS="ruby24" USERLAND="GNU" VIDEO_CARDS="intel i965" XTABLES_ADDONS="quota2 psd pknock lscan length2 ipv4options ipset ipp2p iface geoip fuzzy condition tee tarpit sysrq steal rawnat logmark ipmark dhcpmac delude chaos account"
Unset:  CC, CPPFLAGS, CTARGET, CXX, INSTALL_MASK, LC_ALL, PORTAGE_BINHOST, PORTAGE_BUNZIP2_COMMAND, PORTAGE_COMPRESS, PORTAGE_COMPRESS_FLAGS, PORTAGE_RSYNC_EXTRA_OPTS

# emerge -1pqv =sys-devel/gcc-8.3.0
[ebuild  NS   ] sys-devel/gcc-8.3.0 [8.2.0-r6] USE="cxx fortran graphite (multilib) nls nptl openmp pch pgo (pie) sanitize ssp test vtv (-altivec) -debug -doc (-fixed-point) -go (-hardened) (-jit) (-libssp) -mpx -objc -objc++ -objc-gc -systemtap -vanilla"
Comment 1 Paolo Pedroni 2019-02-26 13:20:20 UTC
Created attachment 566536 [details]
gcc-build-logs.tar.bz2
Comment 2 Paolo Pedroni 2019-02-26 13:28:29 UTC
Created attachment 566538 [details]
gcc-8.3.0:20190225-092156.log.xz.000

The complete build log is too long for bugzilla, so I had to split it.
Comment 3 Paolo Pedroni 2019-02-26 13:28:52 UTC
Created attachment 566540 [details]
gcc-8.3.0:20190225-092156.log.xz.001
Comment 4 Paolo Pedroni 2019-02-26 13:29:17 UTC
Created attachment 566542 [details]
gcc-8.3.0:20190225-092156.log.xz.002
Comment 5 Paolo Pedroni 2019-02-26 13:29:41 UTC
Created attachment 566544 [details]
gcc-8.3.0:20190225-092156.log.xz.003
Comment 6 Sergei Trofimovich gentoo-dev 2019-02-26 15:02:42 UTC
gcc-8.3.0 is the first release where we enabled tests with FEATURES=test. There will be a lot of broken ones thus don't expect it to pass for now.

But eventually we'll sort most things out.
Comment 7 Paolo Pedroni 2019-02-26 15:04:53 UTC
(In reply to Sergei Trofimovich from comment #6)
> gcc-8.3.0 is the first release where we enabled tests with FEATURES=test.

I've noticed. ;)

> There will be a lot of broken ones thus don't expect it to pass for now.

Ok. Note taken.

> But eventually we'll sort most things out.

Take this bug as a first step, then. Thanks for your work.
Comment 8 Rolf Eike Beer 2019-05-07 19:02:05 UTC
Created attachment 575472 [details]
test failures on sparc

893 fails on sparc.
Comment 9 Rolf Eike Beer 2020-06-16 16:47:57 UTC
Created attachment 644976 [details]
build.log for 8.4.0 hppa
Comment 10 Rolf Eike Beer 2020-07-23 18:55:00 UTC
Created attachment 650382 [details]
build.log for 8.4.0-r1 for hppa
Comment 11 Sergei Trofimovich gentoo-dev 2020-07-24 08:05:29 UTC
(In reply to Rolf Eike Beer from comment #10)
> Created attachment 650382 [details]
> build.log for 8.4.0-r1 for hppa

Seeing faiures is unfortunate, but we are not down to 0/small-count errors on x86_64 either. Scrolling through errors is looks like we have a bit of everything here and there. I'd say it's ok to go stable.