Gentoo Websites Logo
Go to: Gentoo Home Documentation Forums Lists Bugs Planet Store Wiki Get Gentoo!
Bug 673972 - media-libs/glm-0.9.9.4: 80 - test-gtc_packing (Failed) on ppc/ppc64
Summary: media-libs/glm-0.9.9.4: 80 - test-gtc_packing (Failed) on ppc/ppc64
Status: UNCONFIRMED
Alias: None
Product: Gentoo Linux
Classification: Unclassified
Component: Current packages (show other bugs)
Hardware: PPC64 Linux
: Normal normal (vote)
Assignee: Tupone Alfredo
URL: https://github.com/g-truc/glm/issues/897
Whiteboard:
Keywords: TESTFAILURE
Depends on:
Blocks: 670500
  Show dependency tree
 
Reported: 2018-12-29 12:26 UTC by ernsteiswuerfel
Modified: 2019-04-26 18:42 UTC (History)
0 users

See Also:
Package list:
Runtime testing required: ---


Attachments
build.log (glm-0.9.9.3:20181229-120720.log,451.05 KB, text/plain)
2018-12-29 12:26 UTC, ernsteiswuerfel
Details
LastTest.log.xz (LastTest.log.xz,7.72 KB, application/x-xz)
2018-12-29 12:27 UTC, ernsteiswuerfel
Details
emerge --info (file_673972.txt,5.80 KB, text/plain)
2018-12-29 12:28 UTC, ernsteiswuerfel
Details
build.log (0.9.9.5, ppc64) (glm-0.9.9.5:20190426-175958.log,323.58 KB, text/plain)
2019-04-26 18:19 UTC, ernsteiswuerfel
Details

Note You need to log in before you can comment on or make changes to this bug.
Description ernsteiswuerfel 2018-12-29 12:26:55 UTC
Created attachment 558798 [details]
build.log

[...]
99% tests passed, 1 tests failed out of 152

Total Test time (real) =   5.82 sec

The following tests FAILED:
	 79 - test-gtc_packing (Failed)
Errors while running CTest

Fails on ppc too (see bug #670500).
Comment 1 ernsteiswuerfel 2018-12-29 12:27:54 UTC
Created attachment 558800 [details]
LastTest.log.xz
Comment 2 ernsteiswuerfel 2018-12-29 12:28:43 UTC
Created attachment 558802 [details]
emerge --info
Comment 3 Tupone Alfredo gentoo-dev 2019-04-02 14:06:31 UTC
Could you please test the glm-0.9.9.4 and see if this bug still applies
Comment 4 ernsteiswuerfel 2019-04-02 14:21:40 UTC
Yes, the test failure is still around in glm-0.9.9.4.

[...]
 80/153 Test  #80: test-gtc_packing .......................***Failed    0.07 sec
[...]
99% tests passed, 1 tests failed out of 153

Total Test time (real) =   5.22 sec

The following tests FAILED:
	 80 - test-gtc_packing (Failed)
Errors while running CTest
 * ERROR: media-libs/glm-0.9.9.4::gentoo failed (test phase):
Comment 5 ernsteiswuerfel 2019-04-26 18:19:27 UTC
Created attachment 574284 [details]
build.log (0.9.9.5, ppc64)

Still around in 0.9.9.5.
Comment 6 ernsteiswuerfel 2019-04-26 18:42:53 UTC
Took it upstream.