Gentoo Websites Logo
Go to: Gentoo Home Documentation Forums Lists Bugs Planet Store Wiki Get Gentoo!
Bug 667902 - dev-python/entrypoints-0.2.3 fails test test_bad - AssertionError
Summary: dev-python/entrypoints-0.2.3 fails test test_bad - AssertionError
Status: IN_PROGRESS
Alias: None
Product: Gentoo Linux
Classification: Unclassified
Component: Current packages (show other bugs)
Hardware: All Linux
: Normal normal (vote)
Assignee: Gentoo Science Related Packages
URL:
Whiteboard:
Keywords: TESTFAILURE
Depends on:
Blocks:
 
Reported: 2018-10-06 17:44 UTC by eroen
Modified: 2020-06-10 08:10 UTC (History)
5 users (show)

See Also:
Package list:
Runtime testing required: ---


Attachments
/var/log/portage/build/dev-python/entrypoints-0.2.3:20181006-154729.log (entrypoints-0.2.3:20181006-154729.log,14.17 KB, text/plain)
2018-10-06 17:44 UTC, eroen
Details

Note You need to log in before you can comment on or make changes to this bug.
Description eroen 2018-10-06 17:44:56 UTC
Created attachment 549528 [details]
/var/log/portage/build/dev-python/entrypoints-0.2.3:20181006-154729.log

=================================================== FAILURES ===================================================
___________________________________________________ test_bad ___________________________________________________

    def test_bad():
        bad_path = [osp.join(samples_dir, 'packages3')]
    
        with warnings.catch_warnings(record=True) as w:
            group = entrypoints.get_group_named('entrypoints.test1', bad_path)
    
        assert 'bad' not in group
>       assert len(w) == 1
E       assert 2 == 1
E        +  where 2 = len([<warnings.WarningMessage object at 0x7fef067bb150>, <warnings.WarningMessage object at 0x7fef06702c50>])

tests/test_entrypoints.py:70: AssertionError
=============================================== warnings summary ===============================================
/var/tmp/portage/dev-python/entrypoints-0.2.3/work/entrypoints-0.2.3-python2_7/test/lib/entrypoints/entrypoints.py:171: DeprecationWarning: You passed a bytestring as `filenames`. This will not work on Python 3. Use `cp.read_file()` or switch to using Unicode strings across the board.
  cp.read(path)
/var/tmp/portage/dev-python/entrypoints-0.2.3/work/entrypoints-0.2.3-python2_7/test/lib/entrypoints/entrypoints.py:140: DeprecationWarning: You passed a bytestring as `filenames`. This will not work on Python 3. Use `cp.read_file()` or switch to using Unicode strings across the board.
  cp.read(ep_path)
/var/tmp/portage/dev-python/entrypoints-0.2.3/work/entrypoints-0.2.3-python2_7/test/lib/entrypoints/entrypoints.py:171: DeprecationWarning: You passed a bytestring as `filenames`. This will not work on Python 3. Use `cp.read_file()` or switch to using Unicode strings across the board.
  cp.read(path)

/var/tmp/portage/dev-python/entrypoints-0.2.3/work/entrypoints-0.2.3-python2_7/test/lib/entrypoints/entrypoints.py:171: DeprecationWarning: You passed a bytestring as `filenames`. This will not work on Python 3. Use `cp.read_file()` or switch to using Unicode strings across the board.
  cp.read(path)
/var/tmp/portage/dev-python/entrypoints-0.2.3/work/entrypoints-0.2.3-python2_7/test/lib/entrypoints/entrypoints.py:140: DeprecationWarning: You passed a bytestring as `filenames`. This will not work on Python 3. Use `cp.read_file()` or switch to using Unicode strings across the board.
  cp.read(ep_path)
/var/tmp/portage/dev-python/entrypoints-0.2.3/work/entrypoints-0.2.3-python2_7/test/lib/entrypoints/entrypoints.py:171: DeprecationWarning: You passed a bytestring as `filenames`. This will not work on Python 3. Use `cp.read_file()` or switch to using Unicode strings across the board.
  cp.read(path)

/var/tmp/portage/dev-python/entrypoints-0.2.3/work/entrypoints-0.2.3-python2_7/test/lib/entrypoints/entrypoints.py:171: DeprecationWarning: You passed a bytestring as `filenames`. This will not work on Python 3. Use `cp.read_file()` or switch to using Unicode strings across the board.
  cp.read(path)
/var/tmp/portage/dev-python/entrypoints-0.2.3/work/entrypoints-0.2.3-python2_7/test/lib/entrypoints/entrypoints.py:171: DeprecationWarning: You passed a bytestring as `filenames`. This will not work on Python 3. Use `cp.read_file()` or switch to using Unicode strings across the board.
  cp.read(path)
/var/tmp/portage/dev-python/entrypoints-0.2.3/work/entrypoints-0.2.3-python2_7/test/lib/entrypoints/entrypoints.py:140: DeprecationWarning: You passed a bytestring as `filenames`. This will not work on Python 3. Use `cp.read_file()` or switch to using Unicode strings across the board.
  cp.read(ep_path)
/var/tmp/portage/dev-python/entrypoints-0.2.3/work/entrypoints-0.2.3-python2_7/test/lib/entrypoints/entrypoints.py:171: DeprecationWarning: You passed a bytestring as `filenames`. This will not work on Python 3. Use `cp.read_file()` or switch to using Unicode strings across the board.
  cp.read(path)

/var/tmp/portage/dev-python/entrypoints-0.2.3/work/entrypoints-0.2.3-python2_7/test/lib/entrypoints/entrypoints.py:171: DeprecationWarning: You passed a bytestring as `filenames`. This will not work on Python 3. Use `cp.read_file()` or switch to using Unicode strings across the board.
  cp.read(path)
/var/tmp/portage/dev-python/entrypoints-0.2.3/work/entrypoints-0.2.3-python2_7/test/lib/entrypoints/entrypoints.py:171: DeprecationWarning: You passed a bytestring as `filenames`. This will not work on Python 3. Use `cp.read_file()` or switch to using Unicode strings across the board.
  cp.read(path)
/var/tmp/portage/dev-python/entrypoints-0.2.3/work/entrypoints-0.2.3-python2_7/test/lib/entrypoints/entrypoints.py:140: DeprecationWarning: You passed a bytestring as `filenames`. This will not work on Python 3. Use `cp.read_file()` or switch to using Unicode strings across the board.
  cp.read(ep_path)
/var/tmp/portage/dev-python/entrypoints-0.2.3/work/entrypoints-0.2.3-python2_7/test/lib/entrypoints/entrypoints.py:171: DeprecationWarning: You passed a bytestring as `filenames`. This will not work on Python 3. Use `cp.read_file()` or switch to using Unicode strings across the board.
  cp.read(path)

/var/tmp/portage/dev-python/entrypoints-0.2.3/work/entrypoints-0.2.3-python2_7/test/lib/entrypoints/entrypoints.py:171: DeprecationWarning: You passed a bytestring as `filenames`. This will not work on Python 3. Use `cp.read_file()` or switch to using Unicode strings across the board.
  cp.read(path)
/var/tmp/portage/dev-python/entrypoints-0.2.3/work/entrypoints-0.2.3-python2_7/test/lib/entrypoints/entrypoints.py:140: DeprecationWarning: You passed a bytestring as `filenames`. This will not work on Python 3. Use `cp.read_file()` or switch to using Unicode strings across the board.
  cp.read(ep_path)
/var/tmp/portage/dev-python/entrypoints-0.2.3/work/entrypoints-0.2.3-python2_7/test/lib/entrypoints/entrypoints.py:171: DeprecationWarning: You passed a bytestring as `filenames`. This will not work on Python 3. Use `cp.read_file()` or switch to using Unicode strings across the board.
  cp.read(path)

/var/tmp/portage/dev-python/entrypoints-0.2.3/work/entrypoints-0.2.3-python2_7/test/lib/entrypoints/entrypoints.py:171: DeprecationWarning: You passed a bytestring as `filenames`. This will not work on Python 3. Use `cp.read_file()` or switch to using Unicode strings across the board.
  cp.read(path)
/var/tmp/portage/dev-python/entrypoints-0.2.3/work/entrypoints-0.2.3-python2_7/test/lib/entrypoints/entrypoints.py:140: DeprecationWarning: You passed a bytestring as `filenames`. This will not work on Python 3. Use `cp.read_file()` or switch to using Unicode strings across the board.
  cp.read(ep_path)
/var/tmp/portage/dev-python/entrypoints-0.2.3/work/entrypoints-0.2.3-python2_7/test/lib/entrypoints/entrypoints.py:171: DeprecationWarning: You passed a bytestring as `filenames`. This will not work on Python 3. Use `cp.read_file()` or switch to using Unicode strings across the board.
  cp.read(path)

-- Docs: https://docs.pytest.org/en/latest/warnings.html
=============================== 1 failed, 9 passed, 20 warnings in 0.17 seconds ================================
 * ERROR: dev-python/entrypoints-0.2.3::gentoo failed (test phase):
 *   (no error message)
 * 
 * Call stack:
 *     ebuild.sh, line  124:  Called src_test
 *   environment, line 2699:  Called distutils-r1_src_test
 *   environment, line  915:  Called _distutils-r1_run_foreach_impl 'python_test'
 *   environment, line  354:  Called python_foreach_impl 'distutils-r1_run_phase' 'python_test'
 *   environment, line 2221:  Called multibuild_foreach_variant '_python_multibuild_wrapper' 'distutils-r1_run_phase' 'python_test'
 *   environment, line 1569:  Called _multibuild_run '_python_multibuild_wrapper' 'distutils-r1_run_phase' 'python_test'
 *   environment, line 1567:  Called _python_multibuild_wrapper 'distutils-r1_run_phase' 'python_test'
 *   environment, line  578:  Called distutils-r1_run_phase 'python_test'
 *   environment, line  846:  Called python_test
 *   environment, line 2601:  Called die
 * The specific snippet of code:
 *       py.test || die
Comment 1 eroen 2018-10-06 17:45:42 UTC
occam ~ # emerge --info '=dev-python/entrypoints-0.2.3::gentoo'
Portage 2.3.50 (python 3.6.6-final-0, default/linux/amd64/17.0/hardened, gcc-8.2.0, glibc-2.27-r6, 4.18.7-gentoo-o0 x86_64)
=================================================================
                         System Settings
=================================================================
System uname: Linux-4.18.7-gentoo-o0-x86_64-Intel-R-_Core-TM-_i5-2520M_CPU_@_2.50GHz-with-gentoo-2.6
KiB Mem:     7999296 total,   1167284 free
KiB Swap:   16777212 total,  16661260 free
Timestamp of repository gentoo: Fri, 05 Oct 2018 13:30:01 +0000
Head commit of repository gentoo: 42e163a7509358b146c482b5c9de3149db11b76b
Timestamp of repository eroen: Sun, 30 Oct 2016 21:58:42 +0000
Head commit of repository sapher: 9ef31d0bf6a902342746fb03a445d4f8b7ddabef

Head commit of repository wiktorb: 2436f2d433769b4a7c69a4088dbc5acd2645c38c

Head commit of repository gentoo-snappy: 0ea79c799ebe1bc6cd924b9dd707b710eea24e83

Head commit of repository stuff: 37ab7a0657b654f43a683e41d50b061a40bde1ee

sh bash 4.4_p23
ld GNU ld (Gentoo 2.31.1 p3) 2.31.1
ccache version 3.3.4 [disabled]
app-shells/bash:          4.4_p23::gentoo
dev-java/java-config:     2.2.0-r3::gentoo
dev-lang/perl:            5.26.2::gentoo
dev-lang/python:          2.7.15::gentoo, 3.4.8-r1::gentoo, 3.5.5-r1::gentoo, 3.6.6::gentoo, 3.7.0::gentoo
dev-util/ccache:          3.3.4-r1::gentoo
dev-util/cmake:           3.12.2::gentoo
dev-util/pkgconfig:       0.29.2::gentoo
sys-apps/baselayout:      2.6-r1::gentoo
sys-apps/openrc:          0.38.2::gentoo
sys-apps/sandbox:         2.13::gentoo
sys-devel/autoconf:       2.13::gentoo, 2.69-r4::gentoo
sys-devel/automake:       1.11.6-r3::gentoo, 1.13.4-r2::gentoo, 1.14.1-r2::gentoo, 1.15.1-r2::gentoo, 1.16.1-r1::gentoo
sys-devel/binutils:       2.31.1-r1::gentoo
sys-devel/gcc:            6.4.0-r3::gentoo, 7.3.0-r4::gentoo, 8.2.0-r3::gentoo
sys-devel/gcc-config:     2.0::gentoo
sys-devel/libtool:        2.4.6-r5::gentoo
sys-devel/make:           4.2.1-r4::gentoo
sys-kernel/linux-headers: 4.17::gentoo (virtual/os-headers)
sys-libs/glibc:           2.27-r6::gentoo
Repositories:

gentoo
    location: /usr/portage
    sync-type: rsync
    sync-uri: rsync://rsync.gentoo.org/gentoo-portage
    priority: -1000
    sync-rsync-verify-max-age: 24
    sync-rsync-extra-opts: 
    sync-rsync-verify-metamanifest: yes
    sync-rsync-verify-jobs: 1

crossdev
    location: /var/lib/portage/crossdev
    masters: gentoo gamerlay eroen

eroen
    location: /usr/local/portage
    masters: gentoo
    priority: 0

sapher
    location: /var/lib/overlays/sapher
    sync-type: git
    sync-uri: https://github.com/apinsard/sapher-overlay.git
    masters: gentoo

wiktorb
    location: /var/lib/overlays/wiktorb
    sync-type: git
    sync-uri: https://github.com/wiktor-b/overlay.git
    masters: gentoo

dotnet
    location: /var/lib/layman/dotnet
    masters: gentoo
    priority: 50

enlightenment
    location: /var/lib/layman/enlightenment
    masters: gentoo
    priority: 50

flora
    location: /var/lib/layman/flora
    masters: gentoo
    priority: 50

gamerlay
    location: /var/lib/layman/gamerlay
    masters: gentoo
    priority: 50

gentoo-snappy
    location: /usr/local/portage/gentoo-snappy
    sync-type: git
    sync-uri: https://github.com/zyga/gentoo-snappy.git
    masters: gentoo
    priority: 50

glc
    location: /var/lib/layman/glc
    masters: gentoo
    priority: 50

hardened-development
    location: /var/lib/layman/hardened-development
    masters: gentoo
    priority: 50

haskell
    location: /var/lib/layman/haskell
    masters: gentoo
    priority: 50

hasufell
    location: /var/lib/layman/hasufell
    masters: gentoo
    priority: 50

java
    location: /var/lib/layman/java
    masters: gentoo
    priority: 50

laurentb
    location: /var/lib/layman/laurentb
    masters: gentoo
    priority: 50

roslin
    location: /var/lib/layman/roslin
    masters: gentoo
    priority: 50

stuff
    location: /var/lib/layman/stuff
    sync-type: git
    sync-uri: https://github.com/istitov/stuff.git
    masters: gentoo
    priority: 50

sunrise
    location: /var/lib/layman/sunrise
    masters: gentoo
    priority: 50

toolchain
    location: /var/lib/layman/toolchain
    masters: gentoo
    priority: 50

v-fox
    location: /var/lib/layman/v-fox
    masters: gentoo
    priority: 50

ACCEPT_KEYWORDS="amd64 ~amd64"
ACCEPT_LICENSE="*"
CBUILD="x86_64-pc-linux-gnu"
CFLAGS="-march=corei7-avx -pipe -Og -g -gdwarf-4"
CHOST="x86_64-pc-linux-gnu"
CONFIG_PROTECT="/etc /usr/share/config /usr/share/easy-rsa /usr/share/gnupg/qualified.txt"
CONFIG_PROTECT_MASK="/etc/ca-certificates.conf /etc/dconf /etc/env.d /etc/fonts/fonts.conf /etc/gconf /etc/gentoo-release /etc/revdep-rebuild /etc/sandbox.d /etc/terminfo /etc/texmf/language.dat.d /etc/texmf/language.def.d /etc/texmf/updmap.d /etc/texmf/web2c"
CXXFLAGS="-march=corei7-avx -pipe -Og -g -gdwarf-4"
DISTDIR="/var/distfiles"
EMERGE_DEFAULT_OPTS="--jobs=1 --autounmask --quiet-build --nospinner --verbose-conflicts --verbose-slot-rebuilds"
ENV_UNSET="DBUS_SESSION_BUS_ADDRESS DISPLAY PERL5LIB PERL5OPT PERLPREFIX PERL_CORE PERL_MB_OPT PERL_MM_OPT XAUTHORITY XDG_CACHE_HOME XDG_CONFIG_HOME XDG_DATA_HOME XDG_RUNTIME_DIR"
FCFLAGS="-O2 -pipe"
FEATURES="assume-digests binpkg-logs binpkg-multi-instance cgroup collision-protect compressdebug config-protect-if-modified distlocks ebuild-locks fixlafiles installsources ipc-sandbox merge-sync multilib-strict network-sandbox news parallel-fetch parallel-install preserve-libs protect-owned sandbox sfperms split-log splitdebug strict strict-keepdir test unknown-features-warn unmerge-logs unmerge-orphans userfetch userpriv usersandbox usersync xattr"
FFLAGS="-O2 -pipe"
GENTOO_MIRRORS="http://distfiles.gentoo.org"
LANG="en_GB.utf8"
LDFLAGS="-Wl,-O1 -Wl,--as-needed -Wl,--hash-style=gnu"
MAKEOPTS="-j4 -l10"
PKGDIR="/var/packages"
PORTAGE_CONFIGROOT="/"
PORTAGE_RSYNC_OPTS="--recursive --links --safe-links --perms --times --omit-dir-times --compress --force --whole-file --delete --stats --human-readable --timeout=180 --exclude=/distfiles --exclude=/local --exclude=/packages --exclude=/.git"
PORTAGE_TMPDIR="/var/tmp"
USE="X a52 aac acl alsa amd64 apng audio audiofile avresample avx bash-completion bdf bluray bzip2 cairo caps cb cdda cdparanoia cdr cjk corefonts crypt cups curl cxx ddate declarative detex device-mapper dga dia djvu dts dvd dvi2tty dvipdfm ebook egl exif fam ffmpeg fftw fits flac fontconfig g3dvl gallium gbm gcrypt gif gimp git glamor glib gmp gnuplot gnutls gold gpm graphics graphviz gs gstreamer gtk gtk3 hardened highlight iconv icu id3tag idn imagemagick imlib inotify iproute2 ipv6 jbig jpeg jpeg2k jpg json kde kde4 kpathsea latex lcms libffi libssh2 libtirpc libv4l luatex lvm lvm2 lzma lzo man metric mikmod mkv mms mmx mng mp3 mpeg mpg123 multilib multimedia musepack ncurses netlink nptl nut ocr odbc offensive ogg opengl openmp openvg optimization optimized-qmake opus pam pango pcre pdf pgf phonon pie png postscript private-headers pstricks pth publishers python3 qt3support qt4 raw readline samba sbsms scanner science sdl seccomp smp sna sndfile speex spell sqlite sse sse2 sse3 sse4 sse41 sse4_1 sse4_2 ssh ssl ssp ssse3 svg t1lib tesseract test theora threads tiff tls truetype udev unicode usb v4l v4l2 vaapi video vorbis vpx webp wmf x264 xanim xattr xcb xcomposite xetex xft xinerama xkb xml xmlpatterns xorg xosd xpm xrandr xtpax xv xvid xvmc xz zlib zsh-completion" ABI_X86="32 64" APACHE2_MODULES="authn_core authz_core socache_shmcb unixd actions alias auth_basic authn_alias authn_anon authn_dbm authn_default authn_file authz_dbm authz_default authz_groupfile authz_host authz_owner authz_user autoindex cache cgi cgid dav dav_fs dav_lock deflate dir disk_cache env expires ext_filter file_cache filter headers include info log_config logio mem_cache mime mime_magic negotiation rewrite setenvif speling status unique_id userdir usertrack vhost_alias" CALLIGRA_FEATURES="karbon plan sheets stage words" COLLECTD_PLUGINS="df interface irq load memory rrdtool swap syslog" CPU_FLAGS_X86="mmx sse sse2 avx sse3 ssse3 sse4_1 aes avx mmxext popcnt sse3 sse4_1 sse4_2 ssse3" CURL_SSL="openssl" ELIBC="glibc" GPSD_PROTOCOLS="ashtech aivdm earthmate evermore fv18 garmin garmintxt gpsclock isync itrax mtk3301 nmea ntrip navcom oceanserver oldstyle oncore rtcm104v2 rtcm104v3 sirf skytraq superstar2 timing tsip tripmate tnt ublox ubx" GRUB_PLATFORMS="efi-64" INPUT_DEVICES="evdev synaptics" KERNEL="linux" L10N="en en-US en-GB eng" LCD_DEVICES="bayrad cfontz cfontz633 glk hd44780 lb216 lcdm001 mtxorb ncurses text" LIBREOFFICE_EXTENSIONS="presenter-console presenter-minimizer" LLVM_TARGETS="AArch64 ARM BPF X86" OFFICE_IMPLEMENTATION="libreoffice" PHP_TARGETS="php5-3 php5-4" POSTGRES_TARGETS="postgres10" PYTHON_SINGLE_TARGET="python3_6" PYTHON_TARGETS="python2_7 python3_4 python3_5 python3_6 python3_7" QEMU_SOFTMMU_TARGETS="x86_64 i386" RUBY_TARGETS="ruby23" SANE_BACKENDS="plustek" USERLAND="GNU" VIDEO_CARDS="intel i965 ilo" XTABLES_ADDONS="quota2 psd pknock lscan length2 ipv4options ipset ipp2p iface geoip fuzzy condition tee tarpit sysrq steal rawnat logmark ipmark dhcpmac delude chaos account"
Unset:  CC, CPPFLAGS, CTARGET, CXX, INSTALL_MASK, LC_ALL, LINGUAS, PORTAGE_BINHOST, PORTAGE_BUNZIP2_COMMAND, PORTAGE_COMPRESS, PORTAGE_COMPRESS_FLAGS, PORTAGE_RSYNC_EXTRA_OPTS

=================================================================
                        Package Settings
=================================================================

dev-python/entrypoints-0.2.3::gentoo was built with the following:
USE="test -doc" ABI_X86="(64)" PYTHON_TARGETS="python2_7 python3_4 python3_5 python3_6"

occam ~ # emerge -pqv '=dev-python/entrypoints-0.2.3::gentoo'
[ebuild   R   ] dev-python/entrypoints-0.2.3  USE="test -doc" PYTHON_TARGETS="python2_7 python3_4 python3_5 python3_6 python3_7%* -pypy% -pypy3%"
Comment 2 Marius Brehler 2019-07-28 09:45:18 UTC
This issue is fixed with entrypoints 0.3, see upstream issue https://github.com/takluyver/entrypoints/issues/23

I recently opened a PR for entrypoints 0.3, see https://github.com/gentoo/gentoo/pull/12369
Comment 3 Larry the Git Cow gentoo-dev 2019-11-20 23:39:51 UTC
The bug has been referenced in the following commit(s):

https://gitweb.gentoo.org/repo/gentoo.git/commit/?id=a3e173a4cf9b6f3fdd96937d51c8fc2d5d58ed9b

commit a3e173a4cf9b6f3fdd96937d51c8fc2d5d58ed9b
Author:     Marius Brehler <marius.brehler+gentoo@googlemail.com>
AuthorDate: 2019-10-21 08:39:10 +0000
Commit:     Andreas Sturmlechner <asturm@gentoo.org>
CommitDate: 2019-11-20 23:39:37 +0000

    dev-python/entrypoints: Version bump to 0.3
    
    Bug: https://bugs.gentoo.org/667902
    Package-Manager: Portage-2.3.66, Repoman-2.3.16
    Signed-off-by: Marius Brehler <marius.brehler+gentoo@googlemail.com>
    Signed-off-by: Andreas Sturmlechner <asturm@gentoo.org>

 dev-python/entrypoints/Manifest               |  1 +
 dev-python/entrypoints/entrypoints-0.3.ebuild | 54 +++++++++++++++++++++++++++
 2 files changed, 55 insertions(+)
Comment 4 Matthew Thode ( prometheanfire ) archtester Gentoo Infrastructure gentoo-dev Security 2020-01-26 21:27:50 UTC
could just remove it (newer version stable, but that's sci teams package...)