Gentoo Websites Logo
Go to: Gentoo Home Documentation Forums Lists Bugs Planet Store Wiki Get Gentoo!
Bug 666926 - app-crypt/gcr-3.28.0 fails tests - mock prompter couldn't get session bus address: Error spawning command line ?dbus-launch --autolaunch=fe4d4adb1083cfb33a269b1a00261093 --binary-syntax --close-stderr?: Child process exited with code 1
Summary: app-crypt/gcr-3.28.0 fails tests - mock prompter couldn't get session bus add...
Status: UNCONFIRMED
Alias: None
Product: Gentoo Linux
Classification: Unclassified
Component: Current packages (show other bugs)
Hardware: All Linux
: Normal normal (vote)
Assignee: Gentoo Linux Gnome Desktop Team
URL:
Whiteboard:
Keywords: TESTFAILURE
Depends on:
Blocks: 658646
  Show dependency tree
 
Reported: 2018-09-23 21:38 UTC by eroen
Modified: 2018-11-08 07:58 UTC (History)
2 users (show)

See Also:
Package list:
Runtime testing required: ---


Attachments
/var/log/portage/build/app-crypt/gcr-3.28.0:20180923-213341.log (gcr-3.28.0:20180923-213341.log,544.08 KB, text/plain)
2018-09-23 21:38 UTC, eroen
Details
test-suite.log (test-suite.log,395.40 KB, text/plain)
2018-09-23 21:39 UTC, eroen
Details

Note You need to log in before you can comment on or make changes to this bug.
Description eroen 2018-09-23 21:38:06 UTC
Created attachment 547728 [details]
/var/log/portage/build/app-crypt/gcr-3.28.0:20180923-213341.log

(test-system-prompt:854510): Gcr-CRITICAL **: 23:36:30.760: mock prompter couldn't get session bus address: Error spawning command line ?dbus-launch --autolaunch=fe4d4adb1083cfb33a269b1a00261093 --binary-syntax --close-stderr?: Child process exited with code 1
FAIL: test-system-prompt 1 /gcr/system-prompt/open

(test-system-prompt:854527): Gcr-CRITICAL **: 23:36:30.793: mock prompter couldn't get session bus address: Error spawning command line ?dbus-launch --autolaunch=fe4d4adb1083cfb33a269b1a00261093 --binary-syntax --close-stderr?: Child process exited with code 1
FAIL: test-system-prompt 2 /gcr/system-prompt/open-failure

(test-system-prompt:854544): Gcr-CRITICAL **: 23:36:30.828: mock prompter couldn't get session bus address: Error spawning command line ?dbus-launch --autolaunch=fe4d4adb1083cfb33a269b1a00261093 --binary-syntax --close-stderr?: Child process exited with code 1
FAIL: test-system-prompt 3 /gcr/system-prompt/password

(test-system-prompt:854562): Gcr-CRITICAL **: 23:36:30.863: mock prompter couldn't get session bus address: Error spawning command line ?dbus-launch --autolaunch=fe4d4adb1083cfb33a269b1a00261093 --binary-syntax --close-stderr?: Child process exited with code 1
FAIL: test-system-prompt 4 /gcr/system-prompt/password-async

(test-system-prompt:854579): Gcr-CRITICAL **: 23:36:30.895: mock prompter couldn't get session bus address: Error spawning command line ?dbus-launch --autolaunch=fe4d4adb1083cfb33a269b1a00261093 --binary-syntax --close-stderr?: Child process exited with code 1
FAIL: test-system-prompt 5 /gcr/system-prompt/password-cancel

(test-system-prompt:854596): Gcr-CRITICAL **: 23:36:30.929: mock prompter couldn't get session bus address: Error spawning command line ?dbus-launch --autolaunch=fe4d4adb1083cfb33a269b1a00261093 --binary-syntax --close-stderr?: Child process exited with code 1
FAIL: test-system-prompt 6 /gcr/system-prompt/password-in-exchange

(test-system-prompt:854613): Gcr-CRITICAL **: 23:36:30.964: mock prompter couldn't get session bus address: Error spawning command line ?dbus-launch --autolaunch=fe4d4adb1083cfb33a269b1a00261093 --binary-syntax --close-stderr?: Child process exited with code 1
FAIL: test-system-prompt 7 /gcr/system-prompt/password-custom-exchange

(test-system-prompt:854630): Gcr-CRITICAL **: 23:36:30.998: mock prompter couldn't get session bus address: Error spawning command line ?dbus-launch --autolaunch=fe4d4adb1083cfb33a269b1a00261093 --binary-syntax --close-stderr?: Child process exited with code 1
FAIL: test-system-prompt 8 /gcr/system-prompt/confirm

(test-system-prompt:854647): Gcr-CRITICAL **: 23:36:31.032: mock prompter couldn't get session bus address: Error spawning command line ?dbus-launch --autolaunch=fe4d4adb1083cfb33a269b1a00261093 --binary-syntax --close-stderr?: Child process exited with code 1
FAIL: test-system-prompt 9 /gcr/system-prompt/confirm-async

(test-system-prompt:854664): Gcr-CRITICAL **: 23:36:31.065: mock prompter couldn't get session bus address: Error spawning command line ?dbus-launch --autolaunch=fe4d4adb1083cfb33a269b1a00261093 --binary-syntax --close-stderr?: Child process exited with code 1
FAIL: test-system-prompt 10 /gcr/system-prompt/confirm-cancel

(test-system-prompt:854681): Gcr-CRITICAL **: 23:36:31.101: mock prompter couldn't get session bus address: Error spawning command line ?dbus-launch --autolaunch=fe4d4adb1083cfb33a269b1a00261093 --binary-syntax --close-stderr?: Child process exited with code 1
FAIL: test-system-prompt 11 /gcr/system-prompt/properties

(test-system-prompt:854698): Gcr-CRITICAL **: 23:36:31.135: mock prompter couldn't get session bus address: Error spawning command line ?dbus-launch --autolaunch=fe4d4adb1083cfb33a269b1a00261093 --binary-syntax --close-stderr?: Child process exited with code 1
FAIL: test-system-prompt 12 /gcr/system-prompt/properties-unset

(test-system-prompt:854715): Gcr-CRITICAL **: 23:36:31.168: mock prompter couldn't get session bus address: Error spawning command line ?dbus-launch --autolaunch=fe4d4adb1083cfb33a269b1a00261093 --binary-syntax --close-stderr?: Child process exited with code 1
FAIL: test-system-prompt 13 /gcr/system-prompt/properties-reset

(test-system-prompt:854732): Gcr-CRITICAL **: 23:36:31.204: mock prompter couldn't get session bus address: Error spawning command line ?dbus-launch --autolaunch=fe4d4adb1083cfb33a269b1a00261093 --binary-syntax --close-stderr?: Child process exited with code 1
FAIL: test-system-prompt 14 /gcr/system-prompt/close

(test-system-prompt:854749): Gcr-CRITICAL **: 23:36:31.236: mock prompter couldn't get session bus address: Error spawning command line ?dbus-launch --autolaunch=fe4d4adb1083cfb33a269b1a00261093 --binary-syntax --close-stderr?: Child process exited with code 1
FAIL: test-system-prompt 15 /gcr/system-prompt/close-cancels

(test-system-prompt:854766): Gcr-CRITICAL **: 23:36:31.269: mock prompter couldn't get session bus address: Error spawning command line ?dbus-launch --autolaunch=fe4d4adb1083cfb33a269b1a00261093 --binary-syntax --close-stderr?: Child process exited with code 1
FAIL: test-system-prompt 16 /gcr/system-prompt/after-close-dismisses

(test-system-prompt:854783): Gcr-CRITICAL **: 23:36:31.304: mock prompter couldn't get session bus address: Error spawning command line ?dbus-launch --autolaunch=fe4d4adb1083cfb33a269b1a00261093 --binary-syntax --close-stderr?: Child process exited with code 1
FAIL: test-system-prompt 17 /gcr/system-prompt/close-from-prompter

(test-system-prompt:854800): Gcr-CRITICAL **: 23:36:31.343: mock prompter couldn't get session bus address: Error spawning command line ?dbus-launch --autolaunch=fe4d4adb1083cfb33a269b1a00261093 --binary-syntax --close-stderr?: Child process exited with code 1
FAIL: test-system-prompt 18 /gcr/system-prompt/watch-cancels
ERROR: test-system-prompt process failed: 251
PASS: test-ssh-askpass 1 /gcr/ssh-askpass/ssh-keygen
Load key "/var/tmp/portage/app-crypt/gcr-3.28.0/work/gcr-3.28.0/gcr/fixtures/pem-rsa-enc.key": incorrect passphrase supplied to decrypt private key
PASS: test-ssh-askpass 2 /gcr/ssh-askpass/cancelled
PASS: test-ssh-askpass 3 /gcr/ssh-askpass/properties
============================================================================
Testsuite summary for gcr 3.28.0
============================================================================
# TOTAL: 602
# PASS:  583
# SKIP:  0
# XFAIL: 0
# FAIL:  18
# XPASS: 0
# ERROR: 1
============================================================================
See ./test-suite.log
Please report to http://bugzilla.gnome.org/enter_bug.cgi?product=gnome-keyring&component=gcr
============================================================================
make[4]: *** [Makefile:5452: test-suite.log] Error 1
make[4]: Leaving directory '/var/tmp/portage/app-crypt/gcr-3.28.0/work/gcr-3.28.0'
make[3]: *** [Makefile:5560: check-TESTS] Error 2
make[3]: Leaving directory '/var/tmp/portage/app-crypt/gcr-3.28.0/work/gcr-3.28.0'
make[2]: *** [Makefile:6085: check-am] Error 2
make[2]: Leaving directory '/var/tmp/portage/app-crypt/gcr-3.28.0/work/gcr-3.28.0'
make[1]: *** [Makefile:5337: check-recursive] Error 1
make[1]: Leaving directory '/var/tmp/portage/app-crypt/gcr-3.28.0/work/gcr-3.28.0'
make: *** [Makefile:6087: check] Error 2
emake failed
 * ERROR: app-crypt/gcr-3.28.0::gentoo failed (test phase):
 *   Failed to run 'emake check'
 * 
 * Call stack:
 *     ebuild.sh, line  124:  Called src_test
 *   environment, line 3657:  Called virtx 'emake' 'check'
 *   environment, line 4640:  Called die
 * The specific snippet of code:
 *       [[ ${retval} -ne 0 ]] && die "Failed to run '$@'";
Comment 1 eroen 2018-09-23 21:39:02 UTC
Created attachment 547730 [details]
test-suite.log
Comment 2 eroen 2018-09-23 21:39:48 UTC
occam ~ # emerge --info '=app-crypt/gcr-3.28.0::gentoo'
Portage 2.3.49 (python 3.6.6-final-0, default/linux/amd64/17.0/hardened, gcc-8.2.0, glibc-2.27-r6, 4.18.7-gentoo-o0 x86_64)
=================================================================
                         System Settings
=================================================================
System uname: Linux-4.18.7-gentoo-o0-x86_64-Intel-R-_Core-TM-_i5-2520M_CPU_@_2.50GHz-with-gentoo-2.6
KiB Mem:     7999308 total,   2660132 free
KiB Swap:   16777212 total,  16726524 free
Timestamp of repository gentoo: Sun, 23 Sep 2018 14:30:01 +0000
Head commit of repository gentoo: 50c1a9fafc114f662de85209ad766b2c1d7789ec
Timestamp of repository eroen: Sun, 30 Oct 2016 21:58:42 +0000
Head commit of repository sapher: 9ef31d0bf6a902342746fb03a445d4f8b7ddabef

Head commit of repository wiktorb: 2436f2d433769b4a7c69a4088dbc5acd2645c38c

Head commit of repository gentoo-snappy: 0ea79c799ebe1bc6cd924b9dd707b710eea24e83

Head commit of repository stuff: 1a53a53ab7f1bd3316e0fa6428d5fd2fc1da4df1

sh bash 4.4_p23
ld GNU ld (Gentoo 2.31.1 p3) 2.31.1
ccache version 3.3.4 [disabled]
app-shells/bash:          4.4_p23::gentoo
dev-java/java-config:     2.2.0-r3::gentoo
dev-lang/perl:            5.26.2::gentoo
dev-lang/python:          2.7.15::gentoo, 3.4.8-r1::gentoo, 3.5.5-r1::gentoo, 3.6.6::gentoo, 3.7.0::gentoo
dev-util/ccache:          3.3.4-r1::gentoo
dev-util/cmake:           3.12.2::gentoo
dev-util/pkgconfig:       0.29.2::gentoo
sys-apps/baselayout:      2.6-r1::gentoo
sys-apps/openrc:          0.38.2::gentoo
sys-apps/sandbox:         2.13::gentoo
sys-devel/autoconf:       2.13::gentoo, 2.69-r4::gentoo
sys-devel/automake:       1.11.6-r3::gentoo, 1.13.4-r2::gentoo, 1.14.1-r2::gentoo, 1.15.1-r2::gentoo, 1.16.1-r1::gentoo
sys-devel/binutils:       2.31.1-r1::gentoo
sys-devel/gcc:            6.4.0-r3::gentoo, 7.3.0-r4::gentoo, 8.2.0-r2::gentoo
sys-devel/gcc-config:     2.0::gentoo
sys-devel/libtool:        2.4.6-r5::gentoo
sys-devel/make:           4.2.1-r4::gentoo
sys-kernel/linux-headers: 4.17::gentoo (virtual/os-headers)
sys-libs/glibc:           2.27-r6::gentoo
Repositories:

gentoo
    location: /usr/portage
    sync-type: rsync
    sync-uri: rsync://rsync.gentoo.org/gentoo-portage
    priority: -1000
    sync-rsync-verify-metamanifest: yes
    sync-rsync-extra-opts: 
    sync-rsync-verify-jobs: 1
    sync-rsync-verify-max-age: 24

crossdev
    location: /var/lib/portage/crossdev
    masters: gentoo gamerlay eroen

eroen
    location: /usr/local/portage
    masters: gentoo
    priority: 0

sapher
    location: /var/lib/overlays/sapher
    sync-type: git
    sync-uri: https://github.com/apinsard/sapher-overlay.git
    masters: gentoo

wiktorb
    location: /var/lib/overlays/wiktorb
    sync-type: git
    sync-uri: https://github.com/wiktor-b/overlay.git
    masters: gentoo

dotnet
    location: /var/lib/layman/dotnet
    masters: gentoo
    priority: 50

enlightenment
    location: /var/lib/layman/enlightenment
    masters: gentoo
    priority: 50

flora
    location: /var/lib/layman/flora
    masters: gentoo
    priority: 50

gamerlay
    location: /var/lib/layman/gamerlay
    masters: gentoo
    priority: 50

gentoo-snappy
    location: /usr/local/portage/gentoo-snappy
    sync-type: git
    sync-uri: https://github.com/zyga/gentoo-snappy.git
    masters: gentoo
    priority: 50

glc
    location: /var/lib/layman/glc
    masters: gentoo
    priority: 50

hardened-development
    location: /var/lib/layman/hardened-development
    masters: gentoo
    priority: 50

haskell
    location: /var/lib/layman/haskell
    masters: gentoo
    priority: 50

hasufell
    location: /var/lib/layman/hasufell
    masters: gentoo
    priority: 50

java
    location: /var/lib/layman/java
    masters: gentoo
    priority: 50

laurentb
    location: /var/lib/layman/laurentb
    masters: gentoo
    priority: 50

roslin
    location: /var/lib/layman/roslin
    masters: gentoo
    priority: 50

stuff
    location: /var/lib/layman/stuff
    sync-type: git
    sync-uri: https://github.com/istitov/stuff.git
    masters: gentoo
    priority: 50

sunrise
    location: /var/lib/layman/sunrise
    masters: gentoo
    priority: 50

toolchain
    location: /var/lib/layman/toolchain
    masters: gentoo
    priority: 50

v-fox
    location: /var/lib/layman/v-fox
    masters: gentoo
    priority: 50

ACCEPT_KEYWORDS="amd64 ~amd64"
ACCEPT_LICENSE="*"
CBUILD="x86_64-pc-linux-gnu"
CFLAGS="-march=corei7-avx -pipe -Og -g -gdwarf-4"
CHOST="x86_64-pc-linux-gnu"
CONFIG_PROTECT="/etc /usr/share/config /usr/share/easy-rsa /usr/share/gnupg/qualified.txt"
CONFIG_PROTECT_MASK="/etc/ca-certificates.conf /etc/dconf /etc/env.d /etc/fonts/fonts.conf /etc/gconf /etc/gentoo-release /etc/revdep-rebuild /etc/sandbox.d /etc/terminfo /etc/texmf/language.dat.d /etc/texmf/language.def.d /etc/texmf/updmap.d /etc/texmf/web2c"
CXXFLAGS="-march=corei7-avx -pipe -Og -g -gdwarf-4"
DISTDIR="/var/distfiles"
EMERGE_DEFAULT_OPTS="--jobs=1 --autounmask --quiet-build --nospinner --verbose-conflicts --verbose-slot-rebuilds"
ENV_UNSET="DBUS_SESSION_BUS_ADDRESS DISPLAY PERL5LIB PERL5OPT PERLPREFIX PERL_CORE PERL_MB_OPT PERL_MM_OPT XAUTHORITY XDG_CACHE_HOME XDG_CONFIG_HOME XDG_DATA_HOME XDG_RUNTIME_DIR"
FCFLAGS="-O2 -pipe"
FEATURES="assume-digests binpkg-logs binpkg-multi-instance cgroup collision-protect compressdebug config-protect-if-modified distlocks ebuild-locks fixlafiles installsources ipc-sandbox merge-sync multilib-strict network-sandbox news parallel-fetch parallel-install preserve-libs protect-owned sandbox sfperms split-log splitdebug strict strict-keepdir test unknown-features-warn unmerge-logs unmerge-orphans userfetch userpriv usersandbox usersync xattr"
FFLAGS="-O2 -pipe"
GENTOO_MIRRORS=""
LANG="en_GB.utf8"
LDFLAGS="-Wl,-O1 -Wl,--as-needed -Wl,--hash-style=gnu"
MAKEOPTS="-j4 -l10"
PKGDIR="/var/packages"
PORTAGE_CONFIGROOT="/"
PORTAGE_RSYNC_OPTS="--recursive --links --safe-links --perms --times --omit-dir-times --compress --force --whole-file --delete --stats --human-readable --timeout=180 --exclude=/distfiles --exclude=/local --exclude=/packages --exclude=/.git"
PORTAGE_TMPDIR="/var/tmp"
USE="X a52 aac acl alsa amd64 apng audio audiofile avresample avx bash-completion bdf bluray bzip2 cairo caps cb cdda cdparanoia cdr cjk corefonts crypt cups curl cxx ddate declarative detex device-mapper dga dia djvu dts dvd dvi2tty dvipdfm ebook egl exif fam ffmpeg fftw fits flac fontconfig g3dvl gallium gbm gcrypt gif gimp git glamor glib gmp gnuplot gnutls gold gpm graphics graphviz gs gstreamer gtk gtk3 hardened highlight hscolour iconv icu id3tag idn imagemagick imlib inotify iproute2 ipv6 jbig jpeg jpeg2k jpg json kde kde4 kpathsea latex lcms libffi libssh2 libtirpc libv4l luatex lvm lvm2 lzma lzo man metric mikmod mkv mms mmx mng mp3 mpeg mpg123 multilib multimedia musepack ncurses netlink nptl nut ocr odbc offensive ogg opengl openmp openvg optimization optimized-qmake opus pam pango pcre pdf pgf phonon pie png postscript private-headers pstricks pth publishers python3 qt3support qt4 raw readline samba sbsms scanner science sdl seccomp smp sna sndfile speex spell sqlite sse sse2 sse3 sse4 sse41 sse4_1 sse4_2 ssh ssl ssp ssse3 svg t1lib tesseract test theora threads tiff tls truetype udev unicode usb v4l v4l2 vaapi video vorbis vpx webp wmf x264 xanim xattr xcb xcomposite xetex xft xinerama xkb xml xmlpatterns xorg xosd xpm xrandr xtpax xv xvid xvmc xz zlib zsh-completion" ABI_X86="32 64" APACHE2_MODULES="authn_core authz_core socache_shmcb unixd actions alias auth_basic authn_alias authn_anon authn_dbm authn_default authn_file authz_dbm authz_default authz_groupfile authz_host authz_owner authz_user autoindex cache cgi cgid dav dav_fs dav_lock deflate dir disk_cache env expires ext_filter file_cache filter headers include info log_config logio mem_cache mime mime_magic negotiation rewrite setenvif speling status unique_id userdir usertrack vhost_alias" CALLIGRA_FEATURES="karbon plan sheets stage words" COLLECTD_PLUGINS="df interface irq load memory rrdtool swap syslog" CPU_FLAGS_X86="mmx sse sse2 avx sse3 ssse3 sse4_1 aes avx mmxext popcnt sse3 sse4_1 sse4_2 ssse3" CURL_SSL="openssl" ELIBC="glibc" GPSD_PROTOCOLS="ashtech aivdm earthmate evermore fv18 garmin garmintxt gpsclock isync itrax mtk3301 nmea ntrip navcom oceanserver oldstyle oncore rtcm104v2 rtcm104v3 sirf skytraq superstar2 timing tsip tripmate tnt ublox ubx" GRUB_PLATFORMS="efi-64" INPUT_DEVICES="evdev synaptics" KERNEL="linux" L10N="en en-US en-GB eng" LCD_DEVICES="bayrad cfontz cfontz633 glk hd44780 lb216 lcdm001 mtxorb ncurses text" LIBREOFFICE_EXTENSIONS="presenter-console presenter-minimizer" LLVM_TARGETS="AArch64 ARM BPF X86" OFFICE_IMPLEMENTATION="libreoffice" PHP_TARGETS="php5-3 php5-4" POSTGRES_TARGETS="postgres10" PYTHON_SINGLE_TARGET="python3_6" PYTHON_TARGETS="python2_7 python3_4 python3_5 python3_6 python3_7" QEMU_SOFTMMU_TARGETS="x86_64 i386" RUBY_TARGETS="ruby23" SANE_BACKENDS="plustek" USERLAND="GNU" VIDEO_CARDS="intel i965 ilo" XTABLES_ADDONS="quota2 psd pknock lscan length2 ipv4options ipset ipp2p iface geoip fuzzy condition tee tarpit sysrq steal rawnat logmark ipmark dhcpmac delude chaos account"
Unset:  CC, CPPFLAGS, CTARGET, CXX, INSTALL_MASK, LC_ALL, LINGUAS, PORTAGE_BINHOST, PORTAGE_BUNZIP2_COMMAND, PORTAGE_COMPRESS, PORTAGE_COMPRESS_FLAGS, PORTAGE_RSYNC_EXTRA_OPTS

occam ~ # emerge -pqv '=app-crypt/gcr-3.28.0::gentoo'
[ebuild     U ] app-crypt/gcr-3.28.0 [3.20.0] USE="gtk -debug -introspection -test -vala"
Comment 3 Rolf Eike Beer 2018-11-08 07:58:21 UTC
I get the same on sparc. My bet is that you are using a chroot or dedicated machine that has no DBus server running like me. The test cases should IMHO spawn their own session DBus so whatever they do will not collide with a possible desktop environment, which would surely lead to other test failures at times.