Gentoo Websites Logo
Go to: Gentoo Home Documentation Forums Lists Bugs Planet Store Wiki Get Gentoo!
Bug 666922 - dev-db/clickhouse-18.12.17 : /.../driver.cpp:15:10: fatal error: clang/.../DiagnosticOptions.h: No such file or directory
Summary: dev-db/clickhouse-18.12.17 : /.../driver.cpp:15:10: fatal error: clang/.../Di...
Status: CONFIRMED
Alias: None
Product: Gentoo Linux
Classification: Unclassified
Component: Current packages (show other bugs)
Hardware: All Linux
: Normal normal (vote)
Assignee: No maintainer - Look at https://wiki.gentoo.org/wiki/Project:Proxy_Maintainers if you want to take care of it
URL:
Whiteboard:
Keywords:
Depends on:
Blocks:
 
Reported: 2018-09-23 20:47 UTC by Toralf Förster
Modified: 2019-09-13 15:15 UTC (History)
0 users

See Also:
Package list:
Runtime testing required: ---


Attachments
emerge-info.txt (emerge-info.txt,17.20 KB, text/plain)
2018-09-23 20:47 UTC, Toralf Förster
Details
dev-db:clickhouse-18.12.17:20180923-174423.log.bz2 (dev-db:clickhouse-18.12.17:20180923-174423.log.bz2,29.37 KB, application/x-bzip)
2018-09-23 20:47 UTC, Toralf Förster
Details
emerge-history.txt (emerge-history.txt,164.45 KB, text/plain)
2018-09-23 20:47 UTC, Toralf Förster
Details
environment (environment,129.68 KB, text/plain)
2018-09-23 20:47 UTC, Toralf Förster
Details
etc.portage.tbz2 (etc.portage.tbz2,23.64 KB, application/x-bzip)
2018-09-23 20:47 UTC, Toralf Förster
Details
logs.tbz2 (logs.tbz2,5.37 KB, application/x-bzip)
2018-09-23 20:47 UTC, Toralf Förster
Details
temp.tbz2 (temp.tbz2,59.34 KB, application/x-bzip)
2018-09-23 20:47 UTC, Toralf Förster
Details

Note You need to log in before you can comment on or make changes to this bug.
Description Toralf Förster gentoo-dev 2018-09-23 20:47:04 UTC
/usr/bin/ccache /usr/bin/x86_64-pc-linux-gnu-g++  -isystem /usr/lib/llvm/6/include  -DNDEBUG -O2 -pipe -march=native -fdiagnostics-color=always  -pipe -msse4.1 -msse4.2 -mpopcnt  -fno-omit-frame-pointer  -Wall  -Wnon-virtual-dtor -Wextra -fPIC   -fno-tree-loop-distribute-patterns -Wno-error -Wno-unused-parameter -Wno-non-virtual-dtor -U_LIBCPP_DEBUG -fno-rtti -fno-exceptions -g0 -pthread -std=c++17 -MD -MT dbms/programs/clang/Compiler-6.0.1/CMakeFiles/clickhouse-compiler-lib.dir/driver.cpp.o -MF dbms/programs/clang/Compiler-6.0.1/CMakeFiles/clickhouse-compiler-lib.dir/driver.cpp.o.d -o dbms/programs/clang/Compiler-6.0.1/CMakeFiles/clickhouse-compiler-lib.dir/driver.cpp.o -c /var/tmp/portage/dev-db/clickhouse-18.12.17/work/ClickHouse-18.12.17-stable/dbms/programs/clang/Compiler-6.0.1/driver.cpp
/var/tmp/portage/dev-db/clickhouse-18.12.17/work/ClickHouse-18.12.17-stable/dbms/programs/clang/Compiler-6.0.1/driver.cpp:15:10: fatal error: clang/Basic/DiagnosticOptions.h: No such file or directory
 #include "clang/Basic/DiagnosticOptions.h"
          ^~~~~~~~~~~~~~~~~~~~~~~~~~~~~~~~~
compilation terminated.

  -------------------------------------------------------------------

  This is an unstable amd64 chroot image at a tinderbox (==build bot)
  name: 17.0-desktop-plasma-systemd_20180918-200707

  -------------------------------------------------------------------

gcc-config -l:
 [1] x86_64-pc-linux-gnu-8.2.0 *

Available Python interpreters, in order of preference:
  [1]   python3.6
  [2]   python2.7 (fallback)
Available Ruby profiles:
  [1]   ruby23 (with Rubygems) *
java-config:
The following VMs are available for generation-2:
*)	IcedTea JDK 3.8.0 [icedtea-bin-8]
Available Java Virtual Machines:
  [1]   icedtea-bin-8  system-vm

emerge -qpv dev-db/clickhouse
[ebuild  N    ] dev-db/clickhouse-18.12.17  USE="client server -debug -doc -kafka -mongodb -mysql -static -test -tools" CPU_FLAGS_X86="sse4_2"
Comment 1 Toralf Förster gentoo-dev 2018-09-23 20:47:07 UTC
Created attachment 547700 [details]
emerge-info.txt
Comment 2 Toralf Förster gentoo-dev 2018-09-23 20:47:10 UTC
Created attachment 547702 [details]
dev-db:clickhouse-18.12.17:20180923-174423.log.bz2
Comment 3 Toralf Förster gentoo-dev 2018-09-23 20:47:12 UTC
Created attachment 547704 [details]
emerge-history.txt
Comment 4 Toralf Förster gentoo-dev 2018-09-23 20:47:15 UTC
Created attachment 547706 [details]
environment
Comment 5 Toralf Förster gentoo-dev 2018-09-23 20:47:18 UTC
Created attachment 547708 [details]
etc.portage.tbz2
Comment 6 Toralf Förster gentoo-dev 2018-09-23 20:47:21 UTC
Created attachment 547710 [details]
logs.tbz2
Comment 7 Toralf Förster gentoo-dev 2018-09-23 20:47:24 UTC
Created attachment 547712 [details]
temp.tbz2
Comment 8 Petr Vaněk 2018-11-28 10:46:17 UTC
Emerge fails with the same error also for versions 18.6.0 and 18.10.3.